2024-04-02 17:39.46: New job: test moonpool.0.6, using opam dev
                              from https://github.com/ocaml/opam-repository.git#refs/pull/25612/head (3a08ab5edb682dbb4b1f81bc29f93ab0f6c189c7)
                              on debian-12-ocaml-5.1/i386

To reproduce locally:

cd $(mktemp -d)
git clone --recursive "https://github.com/ocaml/opam-repository.git" && cd "opam-repository" && git fetch origin "refs/pull/25612/head" && git reset --hard 3a08ab5e
git fetch origin master
git merge --no-edit 689abe198230df164170b233c08b7722d4fea5b3
cat > ../Dockerfile <<'END-OF-DOCKERFILE'
FROM ocaml/opam:debian-12-ocaml-5.1@sha256:9a0aa90660f4b239e939fadc53ea7555d41aff47e032433dd10cead82085ec1b
SHELL [ "/usr/bin/linux32", "/bin/sh", "-c" ]
USER 1000:1000
WORKDIR /home/opam
RUN sudo ln -f /usr/bin/opam-dev /usr/bin/opam
RUN opam init --reinit -ni
RUN uname -rs && opam exec -- ocaml -version && opam --version
ENV OPAMDOWNLOADJOBS="1"
ENV OPAMERRLOGLEN="0"
ENV OPAMSOLVERTIMEOUT="500"
ENV OPAMPRECISETRACKING="1"
ENV CI="true"
ENV OPAM_REPO_CI="true"
RUN rm -rf opam-repository/
COPY --chown=1000:1000 . opam-repository/
RUN opam repository set-url --strict default opam-repository/
RUN opam update --depexts || true
ENV OPAMCRITERIA="-removed,-count[avoid-version,changed],-count[version-lag,request],-count[version-lag,changed],-count[missing-depexts,changed],-changed"
ENV OPAMFIXUPCRITERIA="-removed,-count[avoid-version,changed],-count[version-lag,request],-count[version-lag,changed],-count[missing-depexts,changed],-changed"
ENV OPAMUPGRADECRITERIA="-removed,-count[avoid-version,changed],-count[version-lag,request],-count[version-lag,changed],-count[missing-depexts,changed],-changed"
RUN opam pin add -k version -yn moonpool.0.6 0.6
RUN opam reinstall moonpool.0.6; \
    res=$?; \
    test "$res" != 31 && exit "$res"; \
    export OPAMCLI=2.0; \
    build_dir=$(opam var prefix)/.opam-switch/build; \
    failed=$(ls "$build_dir"); \
    partial_fails=""; \
    for pkg in $failed; do \
    if opam show -f x-ci-accept-failures: "$pkg" | grep -qF "\"debian-12\""; then \
    echo "A package failed and has been disabled for CI using the 'x-ci-accept-failures' field."; \
    fi; \
    test "$pkg" != 'moonpool.0.6' && partial_fails="$partial_fails $pkg"; \
    done; \
    test "${partial_fails}" != "" && echo "opam-repo-ci detected dependencies failing: ${partial_fails}"; \
    exit 1
ENV OPAMCRITERIA="-removed,-count[avoid-version,changed],-count[version-lag,request],-count[version-lag,changed],-count[missing-depexts,changed],-changed"
ENV OPAMFIXUPCRITERIA="-removed,-count[avoid-version,changed],-count[version-lag,request],-count[version-lag,changed],-count[missing-depexts,changed],-changed"
ENV OPAMUPGRADECRITERIA="-removed,-count[avoid-version,changed],-count[version-lag,request],-count[version-lag,changed],-count[missing-depexts,changed],-changed"
RUN (opam reinstall --with-test moonpool.0.6) || true
RUN opam reinstall --with-test --verbose moonpool.0.6; \
    res=$?; \
    test "$res" != 31 && exit "$res"; \
    export OPAMCLI=2.0; \
    build_dir=$(opam var prefix)/.opam-switch/build; \
    failed=$(ls "$build_dir"); \
    partial_fails=""; \
    for pkg in $failed; do \
    if opam show -f x-ci-accept-failures: "$pkg" | grep -qF "\"debian-12\""; then \
    echo "A package failed and has been disabled for CI using the 'x-ci-accept-failures' field."; \
    fi; \
    test "$pkg" != 'moonpool.0.6' && partial_fails="$partial_fails $pkg"; \
    done; \
    test "${partial_fails}" != "" && echo "opam-repo-ci detected dependencies failing: ${partial_fails}"; \
    exit 1

END-OF-DOCKERFILE
docker build -f ../Dockerfile .

2024-04-02 17:39.46: Using cache hint "ocaml/opam:debian-12-ocaml-5.1@sha256:9a0aa90660f4b239e939fadc53ea7555d41aff47e032433dd10cead82085ec1b-moonpool.0.6-3a08ab5edb682dbb4b1f81bc29f93ab0f6c189c7"
2024-04-02 17:39.46: Using OBuilder spec:
((from ocaml/opam:debian-12-ocaml-5.1@sha256:9a0aa90660f4b239e939fadc53ea7555d41aff47e032433dd10cead82085ec1b)
 (shell /usr/bin/linux32 /bin/sh -c)
 (user (uid 1000) (gid 1000))
 (workdir /home/opam)
 (run (shell "sudo ln -f /usr/bin/opam-dev /usr/bin/opam"))
 (run (network host)
      (shell "opam init --reinit --config .opamrc-sandbox -ni"))
 (run (shell "uname -rs && opam exec -- ocaml -version && opam --version"))
 (env OPAMDOWNLOADJOBS 1)
 (env OPAMERRLOGLEN 0)
 (env OPAMSOLVERTIMEOUT 500)
 (env OPAMPRECISETRACKING 1)
 (env CI true)
 (env OPAM_REPO_CI true)
 (run (shell "rm -rf opam-repository/"))
 (copy (src .) (dst opam-repository/))
 (run (shell "opam repository set-url --strict default opam-repository/"))
 (run (network host)
      (shell "opam update --depexts || true"))
 (env OPAMCRITERIA -removed,-count[avoid-version,changed],-count[version-lag,request],-count[version-lag,changed],-count[missing-depexts,changed],-changed)
 (env OPAMFIXUPCRITERIA -removed,-count[avoid-version,changed],-count[version-lag,request],-count[version-lag,changed],-count[missing-depexts,changed],-changed)
 (env OPAMUPGRADECRITERIA -removed,-count[avoid-version,changed],-count[version-lag,request],-count[version-lag,changed],-count[missing-depexts,changed],-changed)
 (run (shell "opam pin add -k version -yn moonpool.0.6 0.6"))
 (run (cache (opam-archives (target /home/opam/.opam/download-cache)))
      (network host)
      (shell  "opam reinstall moonpool.0.6;\
             \n        res=$?;\
             \n        test \"$res\" != 31 && exit \"$res\";\
             \n        export OPAMCLI=2.0;\
             \n        build_dir=$(opam var prefix)/.opam-switch/build;\
             \n        failed=$(ls \"$build_dir\");\
             \n        partial_fails=\"\";\
             \n        for pkg in $failed; do\
             \n          if opam show -f x-ci-accept-failures: \"$pkg\" | grep -qF \"\\\"debian-12\\\"\"; then\
             \n            echo \"A package failed and has been disabled for CI using the 'x-ci-accept-failures' field.\";\
             \n          fi;\
             \n          test \"$pkg\" != 'moonpool.0.6' && partial_fails=\"$partial_fails $pkg\";\
             \n        done;\
             \n        test \"${partial_fails}\" != \"\" && echo \"opam-repo-ci detected dependencies failing: ${partial_fails}\";\
             \n        exit 1"))
 (env OPAMCRITERIA -removed,-count[avoid-version,changed],-count[version-lag,request],-count[version-lag,changed],-count[missing-depexts,changed],-changed)
 (env OPAMFIXUPCRITERIA -removed,-count[avoid-version,changed],-count[version-lag,request],-count[version-lag,changed],-count[missing-depexts,changed],-changed)
 (env OPAMUPGRADECRITERIA -removed,-count[avoid-version,changed],-count[version-lag,request],-count[version-lag,changed],-count[missing-depexts,changed],-changed)
 (run (network host)
      (shell "(opam reinstall --with-test moonpool.0.6) || true"))
 (run (shell  "opam reinstall --with-test --verbose moonpool.0.6;\
             \n        res=$?;\
             \n        test \"$res\" != 31 && exit \"$res\";\
             \n        export OPAMCLI=2.0;\
             \n        build_dir=$(opam var prefix)/.opam-switch/build;\
             \n        failed=$(ls \"$build_dir\");\
             \n        partial_fails=\"\";\
             \n        for pkg in $failed; do\
             \n          if opam show -f x-ci-accept-failures: \"$pkg\" | grep -qF \"\\\"debian-12\\\"\"; then\
             \n            echo \"A package failed and has been disabled for CI using the 'x-ci-accept-failures' field.\";\
             \n          fi;\
             \n          test \"$pkg\" != 'moonpool.0.6' && partial_fails=\"$partial_fails $pkg\";\
             \n        done;\
             \n        test \"${partial_fails}\" != \"\" && echo \"opam-repo-ci detected dependencies failing: ${partial_fails}\";\
             \n        exit 1"))
)

2024-04-02 17:39.46: Waiting for resource in pool OCluster
2024-04-03 02:40.48: Waiting for worker…
2024-04-03 02:45.20: Got resource from pool OCluster
Building on x86-bm-c10.sw.ocaml.org
All commits already cached
Updating files:  75% (25188/33415)
Updating files:  76% (25396/33415)
Updating files:  77% (25730/33415)
Updating files:  78% (26064/33415)
Updating files:  79% (26398/33415)
Updating files:  80% (26732/33415)
Updating files:  81% (27067/33415)
Updating files:  82% (27401/33415)
Updating files:  83% (27735/33415)
Updating files:  84% (28069/33415)
Updating files:  85% (28403/33415)
Updating files:  86% (28737/33415)
Updating files:  87% (29072/33415)
Updating files:  88% (29406/33415)
Updating files:  89% (29740/33415)
Updating files:  90% (30074/33415)
Updating files:  91% (30408/33415)
Updating files:  92% (30742/33415)
Updating files:  93% (31076/33415)
Updating files:  94% (31411/33415)
Updating files:  95% (31745/33415)
Updating files:  96% (32079/33415)
Updating files:  97% (32413/33415)
Updating files:  98% (32747/33415)
Updating files:  99% (33081/33415)
Updating files: 100% (33415/33415)
Updating files: 100% (33415/33415), done.
HEAD is now at 689abe1982 Merge pull request #24314 from Khady/release-argon2-1.0.2
Updating 689abe1982..3a08ab5edb
Fast-forward
 packages/moonpool-lwt/moonpool-lwt.0.6/opam | 41 +++++++++++++++++++++++++
 packages/moonpool/moonpool.0.6/opam         | 46 +++++++++++++++++++++++++++++
 2 files changed, 87 insertions(+)
 create mode 100644 packages/moonpool-lwt/moonpool-lwt.0.6/opam
 create mode 100644 packages/moonpool/moonpool.0.6/opam

(from ocaml/opam:debian-12-ocaml-5.1@sha256:9a0aa90660f4b239e939fadc53ea7555d41aff47e032433dd10cead82085ec1b)
WARNING: The requested image's platform (linux/386) does not match the detected host platform (linux/amd64) and no specific platform was requested
2024-04-03 02:45.23 ---> using "dd65fee99c0c47d2b7c97df2bb80aef90642dcd4308de1e8fed03cec3e2dc5ed" from cache

/: (shell /usr/bin/linux32 /bin/sh -c)

/: (user (uid 1000) (gid 1000))

/: (workdir /home/opam)

/home/opam: (run (shell "sudo ln -f /usr/bin/opam-dev /usr/bin/opam"))
2024-04-03 02:45.23 ---> using "d027aaabac4bd9699d40e6b87215001b9326f56212704e4ad2d987ca37e908c9" from cache

/home/opam: (run (network host)
                 (shell "opam init --reinit --config .opamrc-sandbox -ni"))
Configuring from /home/opam/.opamrc-sandbox, then /home/opam/.opamrc, and finally from built-in defaults.
Checking for available remotes: rsync and local, git.
  - you won't be able to use mercurial repositories unless you install the hg command on your system.
  - you won't be able to use darcs repositories unless you install the darcs command on your system.

This development version of opam requires an update to the layout of /home/opam/.opam from version 2.0 to version 2.2~alpha, which can't be reverted.
You may want to back it up before going further.

Continue? [y/n] y
[NOTE] The 'jobs' option was reset, its value was 31 and its new value will vary according to the current number of cores on your machine. You can restore the fixed value using:
           opam option jobs=31 --global
Format upgrade done.

<><> Updating repositories ><><><><><><><><><><><><><><><><><><><><><><><><><><>
[default] synchronised from file:///home/opam/opam-repository
2024-04-03 02:45.50 ---> saved as "0142c9ff15b7e6c3841c4ba3488c444b33f6d87355318b84db19fe9dd2d91282"

/home/opam: (run (shell "uname -rs && opam exec -- ocaml -version && opam --version"))
Linux 5.15.0-101-generic
The OCaml toplevel, version 5.1.1
2.2.0~beta2~dev
2024-04-03 02:45.50 ---> saved as "a4946defbfeb8391f1b41ad8098ff18155943e97b18298d3bf451913640a3d61"

/home/opam: (env OPAMDOWNLOADJOBS 1)

/home/opam: (env OPAMERRLOGLEN 0)

/home/opam: (env OPAMSOLVERTIMEOUT 500)

/home/opam: (env OPAMPRECISETRACKING 1)

/home/opam: (env CI true)

/home/opam: (env OPAM_REPO_CI true)

/home/opam: (run (shell "rm -rf opam-repository/"))
2024-04-03 02:45.58 ---> saved as "776dc5fe9a8f949abea162d560c643291b987dc966ccb3a27cbc7c2c085a4317"

/home/opam: (copy (src .) (dst opam-repository/))
2024-04-03 02:46.06 ---> saved as "db904317c7bcb7a871a178dab2e0c440f577c53811635246e10f344fa34e82b1"

/home/opam: (run (shell "opam repository set-url --strict default opam-repository/"))
[default] Initialised
2024-04-03 02:47.38 ---> saved as "f4173eb60272bd8b5f048812378f9ed51ffa6442235a8fcbc0ab10b695c967fe"

/home/opam: (run (network host)
                 (shell "opam update --depexts || true"))
+ /usr/bin/sudo "apt-get" "update"
- Hit:1 http://deb.debian.org/debian bookworm InRelease
- Get:2 http://deb.debian.org/debian bookworm-updates InRelease [55.4 kB]
- Get:3 http://deb.debian.org/debian-security bookworm-security InRelease [48.0 kB]
- Get:4 http://deb.debian.org/debian-security bookworm-security/main i386 Packages [149 kB]
- Fetched 252 kB in 0s (758 kB/s)
- Reading package lists...
- 
2024-04-03 02:47.39 ---> saved as "a94e6c909aa9be0a519b18dd9f18c4a75e2cd5281b42b47ed86a138c72568741"

/home/opam: (env OPAMCRITERIA -removed,-count[avoid-version,changed],-count[version-lag,request],-count[version-lag,changed],-count[missing-depexts,changed],-changed)

/home/opam: (env OPAMFIXUPCRITERIA -removed,-count[avoid-version,changed],-count[version-lag,request],-count[version-lag,changed],-count[missing-depexts,changed],-changed)

/home/opam: (env OPAMUPGRADECRITERIA -removed,-count[avoid-version,changed],-count[version-lag,request],-count[version-lag,changed],-count[missing-depexts,changed],-changed)

/home/opam: (run (shell "opam pin add -k version -yn moonpool.0.6 0.6"))
moonpool is now pinned to version 0.6
2024-04-03 02:47.40 ---> saved as "e312227f8e477f225edf0ea31ae7b7a84675427a098f8e26115434fe98bd7d73"

/home/opam: (run (cache (opam-archives (target /home/opam/.opam/download-cache)))
                 (network host)
                 (shell  "opam reinstall moonpool.0.6;\
                        \n        res=$?;\
                        \n        test \"$res\" != 31 && exit \"$res\";\
                        \n        export OPAMCLI=2.0;\
                        \n        build_dir=$(opam var prefix)/.opam-switch/build;\
                        \n        failed=$(ls \"$build_dir\");\
                        \n        partial_fails=\"\";\
                        \n        for pkg in $failed; do\
                        \n          if opam show -f x-ci-accept-failures: \"$pkg\" | grep -qF \"\\\"debian-12\\\"\"; then\
                        \n            echo \"A package failed and has been disabled for CI using the 'x-ci-accept-failures' field.\";\
                        \n          fi;\
                        \n          test \"$pkg\" != 'moonpool.0.6' && partial_fails=\"$partial_fails $pkg\";\
                        \n        done;\
                        \n        test \"${partial_fails}\" != \"\" && echo \"opam-repo-ci detected dependencies failing: ${partial_fails}\";\
                        \n        exit 1"))
moonpool.0.6 is not installed. Install it? [y/n] y
The following actions will be performed:
=== install 3 packages
  - install dune     3.14.2       [required by moonpool]
  - install either   1.0.0        [required by moonpool]
  - install moonpool 0.6 (pinned)

<><> Processing actions <><><><><><><><><><><><><><><><><><><><><><><><><><><><>
-> retrieved dune.3.14.2  (cached)
-> retrieved either.1.0.0  (cached)
-> retrieved moonpool.0.6  (cached)
-> installed dune.3.14.2
-> installed either.1.0.0
-> installed moonpool.0.6
Done.
# Run eval $(opam env) to update the current shell environment
2024-04-03 02:49.42 ---> saved as "c3a8b6cfe6233b278e62082d2e3b984bc15b73697c40c84b53b99b1c143dc614"

/home/opam: (env OPAMCRITERIA -removed,-count[avoid-version,changed],-count[version-lag,request],-count[version-lag,changed],-count[missing-depexts,changed],-changed)

/home/opam: (env OPAMFIXUPCRITERIA -removed,-count[avoid-version,changed],-count[version-lag,request],-count[version-lag,changed],-count[missing-depexts,changed],-changed)

/home/opam: (env OPAMUPGRADECRITERIA -removed,-count[avoid-version,changed],-count[version-lag,request],-count[version-lag,changed],-count[missing-depexts,changed],-changed)

/home/opam: (run (network host)
                 (shell "(opam reinstall --with-test moonpool.0.6) || true"))
The following actions will be performed:
=== recompile 1 package
  - recompile moonpool      0.6 (pinned)
=== install 19 packages
  - install   astring       0.8.5        [required by mdx]
  - install   camlp-streams 5.0.1        [required by mdx]
  - install   cmdliner      1.2.0        [required by mdx]
  - install   cppo          1.6.9        [required by mdx]
  - install   csexp         1.5.2        [required by mdx]
  - install   fmt           0.9.0        [required by mdx]
  - install   logs          0.7.0        [required by mdx]
  - install   mdx           2.4.1        [required by moonpool]
  - install   mtime         2.0.0        [required by trace, trace-tef]
  - install   ocaml-version 3.6.5        [required by mdx]
  - install   ocamlbuild    0.14.3       [required by logs, astring, fmt, mtime]
  - install   ocamlfind     1.9.6        [required by mdx]
  - install   qcheck-core   0.21.3       [required by moonpool]
  - install   re            1.11.0       [required by mdx]
  - install   result        1.5          [required by mdx]
  - install   seq           base         [required by re]
  - install   topkg         1.0.7        [required by logs, astring, fmt, mtime]
  - install   trace         0.7          [required by moonpool]
  - install   trace-tef     0.7          [required by moonpool]

<><> Processing actions <><><><><><><><><><><><><><><><><><><><><><><><><><><><>
-> retrieved astring.0.8.5  (https://erratique.ch/software/astring/releases/astring-0.8.5.tbz)
-> retrieved camlp-streams.5.0.1  (https://github.com/ocaml/camlp-streams/archive/v5.0.1.tar.gz)
-> retrieved cmdliner.1.2.0  (https://erratique.ch/software/cmdliner/releases/cmdliner-1.2.0.tbz)
-> retrieved cppo.1.6.9  (https://github.com/ocaml-community/cppo/archive/v1.6.9.tar.gz)
-> installed camlp-streams.5.0.1
-> retrieved csexp.1.5.2  (https://github.com/ocaml-dune/csexp/releases/download/1.5.2/csexp-1.5.2.tbz)
-> retrieved fmt.0.9.0  (https://erratique.ch/software/fmt/releases/fmt-0.9.0.tbz)
-> retrieved logs.0.7.0  (https://erratique.ch/software/logs/releases/logs-0.7.0.tbz)
-> installed csexp.1.5.2
-> retrieved mdx.2.4.1  (https://github.com/realworldocaml/mdx/releases/download/2.4.1/mdx-2.4.1.tbz)
-> retrieved mtime.2.0.0  (https://erratique.ch/software/mtime/releases/mtime-2.0.0.tbz)
-> retrieved ocaml-version.3.6.5  (https://github.com/ocurrent/ocaml-version/releases/download/v3.6.5/ocaml-version-3.6.5.tbz)
-> retrieved ocamlbuild.0.14.3  (https://github.com/ocaml/ocamlbuild/archive/refs/tags/0.14.3.tar.gz)
-> installed ocaml-version.3.6.5
-> retrieved ocamlfind.1.9.6  (http://download.camlcity.org/download/findlib-1.9.6.tar.gz)
-> retrieved qcheck-core.0.21.3  (https://github.com/c-cube/qcheck/archive/v0.21.3.tar.gz)
-> retrieved re.1.11.0  (https://github.com/ocaml/ocaml-re/releases/download/1.11.0/re-1.11.0.tbz)
-> installed cmdliner.1.2.0
-> installed cppo.1.6.9
-> retrieved result.1.5  (https://github.com/janestreet/result/releases/download/1.5/result-1.5.tbz)
-> installed seq.base
-> retrieved topkg.1.0.7  (https://erratique.ch/software/topkg/releases/topkg-1.0.7.tbz)
-> installed result.1.5
-> retrieved trace.0.7, trace-tef.0.7  (https://github.com/c-cube/ocaml-trace/releases/download/v0.7/trace-0.7.tbz)
-> installed re.1.11.0
-> installed qcheck-core.0.21.3
-> installed ocamlfind.1.9.6
-> removed   moonpool.0.6
-> installed ocamlbuild.0.14.3
-> installed topkg.1.0.7
-> installed mtime.2.0.0
-> installed fmt.0.9.0
-> installed trace.0.7
-> installed astring.0.8.5
-> installed trace-tef.0.7
-> installed logs.0.7.0
-> installed mdx.2.4.1
-> installed moonpool.0.6
Done.
# Run eval $(opam env) to update the current shell environment
2024-04-03 02:52.49 ---> saved as "9c37f04678a079916355670115dd0346e8be062178d66946ec3f148db8053066"

/home/opam: (run (shell  "opam reinstall --with-test --verbose moonpool.0.6;\
                        \n        res=$?;\
                        \n        test \"$res\" != 31 && exit \"$res\";\
                        \n        export OPAMCLI=2.0;\
                        \n        build_dir=$(opam var prefix)/.opam-switch/build;\
                        \n        failed=$(ls \"$build_dir\");\
                        \n        partial_fails=\"\";\
                        \n        for pkg in $failed; do\
                        \n          if opam show -f x-ci-accept-failures: \"$pkg\" | grep -qF \"\\\"debian-12\\\"\"; then\
                        \n            echo \"A package failed and has been disabled for CI using the 'x-ci-accept-failures' field.\";\
                        \n          fi;\
                        \n          test \"$pkg\" != 'moonpool.0.6' && partial_fails=\"$partial_fails $pkg\";\
                        \n        done;\
                        \n        test \"${partial_fails}\" != \"\" && echo \"opam-repo-ci detected dependencies failing: ${partial_fails}\";\
                        \n        exit 1"))
The following actions will be performed:
=== recompile 1 package
  - recompile moonpool 0.6 (pinned)

<><> Processing actions <><><><><><><><><><><><><><><><><><><><><><><><><><><><>
Processing  2/4: [moonpool: dune build]
+ /home/opam/.opam/opam-init/hooks/sandbox.sh "build" "dune" "build" "-p" "moonpool" "-j" "39" "@install" "@runtest" (CWD=/home/opam/.opam/5.1/.opam-switch/build/moonpool.0.6)
- (cd _build/default/test && ./t_ws_pool_confusion.exe)
- ok
- File "test/fiber/t_fib1.expected", line 1, characters 0-0:
- /usr/bin/git --no-pager diff --no-index --color=always -u _build/default/test/fiber/t_fib1.expected _build/default/test/fiber/t_fib1.output
- diff --git a/_build/default/test/fiber/t_fib1.expected b/_build/default/test/fiber/t_fib1.output
- index d4e2b79..59497d4 100644
- --- a/_build/default/test/fiber/t_fib1.expected
- +++ b/_build/default/test/fiber/t_fib1.output
- @@ -26,19 +26,18 @@ start
-  ============
-  start
-  1: start fibers
- +1.6.1: sub-fiber 6 was cancelled
-  1.7.1: I'm fiber 7 and I'm about to fail…
- -1.8.1: sub-fiber 8 was cancelled
- -1.9.1: sub-fiber 9 was cancelled
-  2.0: fiber 0 resolved as ok
-  2.1: fiber 1 resolved as ok
-  2.2: fiber 2 resolved as ok
-  2.3: fiber 3 resolved as ok
-  2.4: fiber 4 resolved as ok
-  2.5: fiber 5 resolved as ok
- -2.6: fiber 6 resolved as ok
- +2.6: fiber 6 resolved as error
-  2.7: fiber 7 resolved as error
- -2.8: fiber 8 resolved as error
- -2.9: fiber 9 resolved as error
- +2.8: fiber 8 resolved as ok
- +2.9: fiber 9 resolved as ok
-  3: wait for subs
-  4: await fiber 0
-  5: res 0 = 0
- @@ -53,9 +52,7 @@ start
-  14: await fiber 5
-  15: res 5 = 5
-  16: await fiber 6
- -17: res 6 = 6
- -18: await fiber 7
- -19: main fiber cancelled with Failure("oh no!")
- -20: main fiber result: error Failure("oh no!")
- -21: main fib failed with "oh no!"
- -22: main fiber exited
- +17: main fiber cancelled with Failure("oh no!")
- +18: main fiber result: error Failure("oh no!")
- +19: main fib failed with "oh no!"
- +20: main fiber exited
- (cd _build/default/test && ./t_ws_wait.exe)
- sum=2000000, expected=2000000
- (cd _build/default/test && ./t_chan_train.exe)
- got 1000 events in 4 trains (len=80) in 0.93s
- (cd _build/default/test && ./t_unfair.exe)
- pool size: 300
- pool size after shutdown: 0
- elapsed: 0.4525s
- pool size: 302
- pool size after shutdown: 0
- elapsed: 0.4472s
- (cd _build/default/test && ./t_bench1.exe)
- pool size=4, n=5, j=5
- pool size=4, n=5, j=5
- done
- (cd _build/default/test && ./t_props.exe)
- 
random seed: 511108994
- ================================================================================
- success (ran 4 tests)
- (cd _build/default/test && ./t_tree_futs.exe)
- n=16, j=4
- n: 32768, n': 32768 (in 1.06s)
- n=16, j=4
- n: 32768, n': 32768 (in 1.49s)
- (cd _build/default/test && ./t_ws_deque.exe)
- basic tests passed
- ref sum = 1010000000, sum = 1010000000
- (cd _build/default/test && ./t_fib_rec.exe)
- fib 40 = 165580141
- test fifo(4)
- test pool(1)
- test pool(2)
- test pool(4)
- test pool(8)
- test pool(4)
- test pool(4)
- test pool(4)
[ERROR] The compilation of moonpool.0.6 failed at "dune build -p moonpool -j 39 @install @runtest".

#=== ERROR while compiling moonpool.0.6 =======================================#
# context              2.2.0~beta2~dev | linux/x86_32 | ocaml-base-compiler.5.1.1 | pinned(https://github.com/c-cube/moonpool/releases/download/v0.6/moonpool-0.6.tbz)
# path                 ~/.opam/5.1/.opam-switch/build/moonpool.0.6
# command              ~/.opam/opam-init/hooks/sandbox.sh build dune build -p moonpool -j 39 @install @runtest
# exit-code            1
# env-file             ~/.opam/log/moonpool-7-77c722.env
# output-file          ~/.opam/log/moonpool-7-77c722.out
### output ###
# (cd _build/default/test && ./t_ws_pool_confusion.exe)
# ok
# File "test/fiber/t_fib1.expected", line 1, characters 0-0:
# /usr/bin/git --no-pager diff --no-index --color=always -u _build/default/test/fiber/t_fib1.expected _build/default/test/fiber/t_fib1.output
# diff --git a/_build/default/test/fiber/t_fib1.expected b/_build/default/test/fiber/t_fib1.output
# index d4e2b79..59497d4 100644
# --- a/_build/default/test/fiber/t_fib1.expected
# +++ b/_build/default/test/fiber/t_fib1.output
# @@ -26,19 +26,18 @@ start
#  ============
#  start
#  1: start fibers
# +1.6.1: sub-fiber 6 was cancelled
#  1.7.1: I'm fiber 7 and I'm about to fail…
# -1.8.1: sub-fiber 8 was cancelled
# -1.9.1: sub-fiber 9 was cancelled
#  2.0: fiber 0 resolved as ok
#  2.1: fiber 1 resolved as ok
#  2.2: fiber 2 resolved as ok
#  2.3: fiber 3 resolved as ok
#  2.4: fiber 4 resolved as ok
#  2.5: fiber 5 resolved as ok
# -2.6: fiber 6 resolved as ok
# +2.6: fiber 6 resolved as error
#  2.7: fiber 7 resolved as error
# -2.8: fiber 8 resolved as error
# -2.9: fiber 9 resolved as error
# +2.8: fiber 8 resolved as ok
# +2.9: fiber 9 resolved as ok
#  3: wait for subs
#  4: await fiber 0
#  5: res 0 = 0
# @@ -53,9 +52,7 @@ start
#  14: await fiber 5
#  15: res 5 = 5
#  16: await fiber 6
# -17: res 6 = 6
# -18: await fiber 7
# -19: main fiber cancelled with Failure("oh no!")
# -20: main fiber result: error Failure("oh no!")
# -21: main fib failed with "oh no!"
# -22: main fiber exited
# +17: main fiber cancelled with Failure("oh no!")
# +18: main fiber result: error Failure("oh no!")
# +19: main fib failed with "oh no!"
# +20: main fiber exited
# (cd _build/default/test && ./t_ws_wait.exe)
# sum=2000000, expected=2000000
# (cd _build/default/test && ./t_chan_train.exe)
# got 1000 events in 4 trains (len=80) in 0.93s
# (cd _build/default/test && ./t_unfair.exe)
# pool size: 300
# pool size after shutdown: 0
# elapsed: 0.4525s
# pool size: 302
# pool size after shutdown: 0
# elapsed: 0.4472s
# (cd _build/default/test && ./t_bench1.exe)
# pool size=4, n=5, j=5
# pool size=4, n=5, j=5
# done
# (cd _build/default/test && ./t_props.exe)
# 
random seed: 511108994
# ================================================================================
# success (ran 4 tests)
# (cd _build/default/test && ./t_tree_futs.exe)
# n=16, j=4
# n: 32768, n': 32768 (in 1.06s)
# n=16, j=4
# n: 32768, n': 32768 (in 1.49s)
# (cd _build/default/test && ./t_ws_deque.exe)
# basic tests passed
# ref sum = 1010000000, sum = 1010000000
# (cd _build/default/test && ./t_fib_rec.exe)
# fib 40 = 165580141
# test fifo(4)
# test pool(1)
# test pool(2)
# test pool(4)
# test pool(8)
# test pool(4)
# test pool(4)
# test pool(4)



<><> Error report <><><><><><><><><><><><><><><><><><><><><><><><><><><><><><><>
+- The following actions failed
| - build moonpool 0.6
+- 
- No changes have been performed
# Run eval $(opam env) to update the current shell environment
'opam reinstall --with-test --verbose moonpool.0.6' failed.
[WARNING] OPAMCONFIRMLEVEL was ignored because CLI 2.0 was requested and it was introduced in 2.1.
[WARNING] OPAMCONFIRMLEVEL was ignored because CLI 2.0 was requested and it was introduced in 2.1.
"/usr/bin/linux32" "/bin/sh" "-c" "opam reinstall --with-test --verbose moonpool.0.6;
        res=$?;
        test "$res" != 31 && exit "$res";
        export OPAMCLI=2.0;
        build_dir=$(opam var prefix)/.opam-switch/build;
        failed=$(ls "$build_dir");
        partial_fails="";
        for pkg in $failed; do
          if opam show -f x-ci-accept-failures: "$pkg" | grep -qF "\"debian-12\""; then
            echo "A package failed and has been disabled for CI using the 'x-ci-accept-failures' field.";
          fi;
          test "$pkg" != 'moonpool.0.6' && partial_fails="$partial_fails $pkg";
        done;
        test "${partial_fails}" != "" && echo "opam-repo-ci detected dependencies failing: ${partial_fails}";
        exit 1" failed with exit status 1
2024-04-03 02:55.23: Job failed: Failed: Build failed
2024-04-03 02:55.23: Log analysis:
2024-04-03 02:55.23: >>> 
[ERROR] The compilation of moonpool.0.6 failed at "dune build -p moonpool -j 39 @install @runtest".
 (score = 20)
2024-04-03 02:55.23: The compilation of moonpool.0.6 failed at "dune build -p moonpool -j 39 @install @runtest".