Build:
  1. 0
2024-02-11 20:23.56: New job: test ppx_rapper_async.3.1.0 with conf-pkg-config.1.1, using opam dev
                              from https://github.com/ocaml/opam-repository.git#refs/pull/25235/head (8c7391d6ec81e93f24de221eb32a886b72d1ede6)
                              on debian-12-ocaml-5.1/amd64

To reproduce locally:

cd $(mktemp -d)
git clone --recursive "https://github.com/ocaml/opam-repository.git" && cd "opam-repository" && git fetch origin "refs/pull/25235/head" && git reset --hard 8c7391d6
git fetch origin master
git merge --no-edit 8477e9a74beb40d85534ab7653b65d45607a147f
cat > ../Dockerfile <<'END-OF-DOCKERFILE'
FROM ocaml/opam:debian-12-ocaml-5.1@sha256:931805f2c2fdb0b5642ae8463ff0780c2ee3f4afb48734a7d94e2d5163429930
USER 1000:1000
WORKDIR /home/opam
RUN sudo ln -f /usr/bin/opam-dev /usr/bin/opam
RUN opam init --reinit -ni
ENV OPAMDOWNLOADJOBS="1"
ENV OPAMERRLOGLEN="0"
ENV OPAMSOLVERTIMEOUT="500"
ENV OPAMPRECISETRACKING="1"
ENV CI="true"
ENV OPAM_REPO_CI="true"
RUN rm -rf opam-repository/
COPY --chown=1000:1000 . opam-repository/
RUN opam repository set-url --strict default opam-repository/
RUN opam update --depexts || true
ENV OPAMCRITERIA="-removed,-count[avoid-version,changed],-count[version-lag,request],-count[version-lag,changed],-count[missing-depexts,changed],-changed"
ENV OPAMFIXUPCRITERIA="-removed,-count[avoid-version,changed],-count[version-lag,request],-count[version-lag,changed],-count[missing-depexts,changed],-changed"
ENV OPAMUPGRADECRITERIA="-removed,-count[avoid-version,changed],-count[version-lag,request],-count[version-lag,changed],-count[missing-depexts,changed],-changed"
RUN opam pin add -k version -yn conf-pkg-config.1.1 1.1
RUN opam reinstall conf-pkg-config.1.1; \
    res=$?; \
    test "$res" != 31 && exit "$res"; \
    export OPAMCLI=2.0; \
    build_dir=$(opam var prefix)/.opam-switch/build; \
    failed=$(ls "$build_dir"); \
    partial_fails=""; \
    for pkg in $failed; do \
    if opam show -f x-ci-accept-failures: "$pkg" | grep -qF "\"debian-12\""; then \
    echo "A package failed and has been disabled for CI using the 'x-ci-accept-failures' field."; \
    fi; \
    test "$pkg" != 'conf-pkg-config.1.1' && partial_fails="$partial_fails $pkg"; \
    done; \
    test "${partial_fails}" != "" && echo "opam-repo-ci detected dependencies failing: ${partial_fails}"; \
    exit 1
ENV OPAMCRITERIA="-removed,-count[avoid-version,changed],-count[version-lag,request],-count[version-lag,changed],-count[missing-depexts,changed],-changed"
ENV OPAMFIXUPCRITERIA="-removed,-count[avoid-version,changed],-count[version-lag,request],-count[version-lag,changed],-count[missing-depexts,changed],-changed"
ENV OPAMUPGRADECRITERIA="-removed,-count[avoid-version,changed],-count[version-lag,request],-count[version-lag,changed],-count[missing-depexts,changed],-changed"
RUN opam reinstall ppx_rapper_async.3.1.0; \
    res=$?; \
    test "$res" != 31 && exit "$res"; \
    export OPAMCLI=2.0; \
    build_dir=$(opam var prefix)/.opam-switch/build; \
    failed=$(ls "$build_dir"); \
    partial_fails=""; \
    for pkg in $failed; do \
    if opam show -f x-ci-accept-failures: "$pkg" | grep -qF "\"debian-12\""; then \
    echo "A package failed and has been disabled for CI using the 'x-ci-accept-failures' field."; \
    fi; \
    test "$pkg" != 'ppx_rapper_async.3.1.0' && partial_fails="$partial_fails $pkg"; \
    done; \
    test "${partial_fails}" != "" && echo "opam-repo-ci detected dependencies failing: ${partial_fails}"; \
    exit 1
ENV OPAMCRITERIA="-removed,-count[avoid-version,changed],-count[version-lag,request],-count[version-lag,changed],-count[missing-depexts,changed],-changed"
ENV OPAMFIXUPCRITERIA="-removed,-count[avoid-version,changed],-count[version-lag,request],-count[version-lag,changed],-count[missing-depexts,changed],-changed"
ENV OPAMUPGRADECRITERIA="-removed,-count[avoid-version,changed],-count[version-lag,request],-count[version-lag,changed],-count[missing-depexts,changed],-changed"
RUN (opam reinstall --with-test ppx_rapper_async.3.1.0) || true
RUN opam reinstall --with-test --verbose ppx_rapper_async.3.1.0; \
    res=$?; \
    test "$res" != 31 && exit "$res"; \
    export OPAMCLI=2.0; \
    build_dir=$(opam var prefix)/.opam-switch/build; \
    failed=$(ls "$build_dir"); \
    partial_fails=""; \
    for pkg in $failed; do \
    if opam show -f x-ci-accept-failures: "$pkg" | grep -qF "\"debian-12\""; then \
    echo "A package failed and has been disabled for CI using the 'x-ci-accept-failures' field."; \
    fi; \
    test "$pkg" != 'ppx_rapper_async.3.1.0' && partial_fails="$partial_fails $pkg"; \
    done; \
    test "${partial_fails}" != "" && echo "opam-repo-ci detected dependencies failing: ${partial_fails}"; \
    exit 1

END-OF-DOCKERFILE
docker build -f ../Dockerfile .

2024-02-11 20:23.56: Using cache hint "ocaml/opam:debian-12-ocaml-5.1@sha256:931805f2c2fdb0b5642ae8463ff0780c2ee3f4afb48734a7d94e2d5163429930-conf-pkg-config.1.1-ppx_rapper_async.3.1.0-8c7391d6ec81e93f24de221eb32a886b72d1ede6"
2024-02-11 20:23.56: Using OBuilder spec:
((from ocaml/opam:debian-12-ocaml-5.1@sha256:931805f2c2fdb0b5642ae8463ff0780c2ee3f4afb48734a7d94e2d5163429930)
 (user (uid 1000) (gid 1000))
 (workdir /home/opam)
 (run (shell "sudo ln -f /usr/bin/opam-dev /usr/bin/opam"))
 (run (network host)
      (shell "opam init --reinit --config .opamrc-sandbox -ni"))
 (env OPAMDOWNLOADJOBS 1)
 (env OPAMERRLOGLEN 0)
 (env OPAMSOLVERTIMEOUT 500)
 (env OPAMPRECISETRACKING 1)
 (env CI true)
 (env OPAM_REPO_CI true)
 (run (shell "rm -rf opam-repository/"))
 (copy (src .) (dst opam-repository/))
 (run (shell "opam repository set-url --strict default opam-repository/"))
 (run (network host)
      (shell "opam update --depexts || true"))
 (env OPAMCRITERIA -removed,-count[avoid-version,changed],-count[version-lag,request],-count[version-lag,changed],-count[missing-depexts,changed],-changed)
 (env OPAMFIXUPCRITERIA -removed,-count[avoid-version,changed],-count[version-lag,request],-count[version-lag,changed],-count[missing-depexts,changed],-changed)
 (env OPAMUPGRADECRITERIA -removed,-count[avoid-version,changed],-count[version-lag,request],-count[version-lag,changed],-count[missing-depexts,changed],-changed)
 (run (shell "opam pin add -k version -yn conf-pkg-config.1.1 1.1"))
 (run (cache (opam-archives (target /home/opam/.opam/download-cache)))
      (network host)
      (shell  "opam reinstall conf-pkg-config.1.1;\
             \n        res=$?;\
             \n        test \"$res\" != 31 && exit \"$res\";\
             \n        export OPAMCLI=2.0;\
             \n        build_dir=$(opam var prefix)/.opam-switch/build;\
             \n        failed=$(ls \"$build_dir\");\
             \n        partial_fails=\"\";\
             \n        for pkg in $failed; do\
             \n          if opam show -f x-ci-accept-failures: \"$pkg\" | grep -qF \"\\\"debian-12\\\"\"; then\
             \n            echo \"A package failed and has been disabled for CI using the 'x-ci-accept-failures' field.\";\
             \n          fi;\
             \n          test \"$pkg\" != 'conf-pkg-config.1.1' && partial_fails=\"$partial_fails $pkg\";\
             \n        done;\
             \n        test \"${partial_fails}\" != \"\" && echo \"opam-repo-ci detected dependencies failing: ${partial_fails}\";\
             \n        exit 1"))
 (env OPAMCRITERIA -removed,-count[avoid-version,changed],-count[version-lag,request],-count[version-lag,changed],-count[missing-depexts,changed],-changed)
 (env OPAMFIXUPCRITERIA -removed,-count[avoid-version,changed],-count[version-lag,request],-count[version-lag,changed],-count[missing-depexts,changed],-changed)
 (env OPAMUPGRADECRITERIA -removed,-count[avoid-version,changed],-count[version-lag,request],-count[version-lag,changed],-count[missing-depexts,changed],-changed)
 (run (cache (opam-archives (target /home/opam/.opam/download-cache)))
      (network host)
      (shell  "opam reinstall ppx_rapper_async.3.1.0;\
             \n        res=$?;\
             \n        test \"$res\" != 31 && exit \"$res\";\
             \n        export OPAMCLI=2.0;\
             \n        build_dir=$(opam var prefix)/.opam-switch/build;\
             \n        failed=$(ls \"$build_dir\");\
             \n        partial_fails=\"\";\
             \n        for pkg in $failed; do\
             \n          if opam show -f x-ci-accept-failures: \"$pkg\" | grep -qF \"\\\"debian-12\\\"\"; then\
             \n            echo \"A package failed and has been disabled for CI using the 'x-ci-accept-failures' field.\";\
             \n          fi;\
             \n          test \"$pkg\" != 'ppx_rapper_async.3.1.0' && partial_fails=\"$partial_fails $pkg\";\
             \n        done;\
             \n        test \"${partial_fails}\" != \"\" && echo \"opam-repo-ci detected dependencies failing: ${partial_fails}\";\
             \n        exit 1"))
 (env OPAMCRITERIA -removed,-count[avoid-version,changed],-count[version-lag,request],-count[version-lag,changed],-count[missing-depexts,changed],-changed)
 (env OPAMFIXUPCRITERIA -removed,-count[avoid-version,changed],-count[version-lag,request],-count[version-lag,changed],-count[missing-depexts,changed],-changed)
 (env OPAMUPGRADECRITERIA -removed,-count[avoid-version,changed],-count[version-lag,request],-count[version-lag,changed],-count[missing-depexts,changed],-changed)
 (run (network host)
      (shell "(opam reinstall --with-test ppx_rapper_async.3.1.0) || true"))
 (run (shell  "opam reinstall --with-test --verbose ppx_rapper_async.3.1.0;\
             \n        res=$?;\
             \n        test \"$res\" != 31 && exit \"$res\";\
             \n        export OPAMCLI=2.0;\
             \n        build_dir=$(opam var prefix)/.opam-switch/build;\
             \n        failed=$(ls \"$build_dir\");\
             \n        partial_fails=\"\";\
             \n        for pkg in $failed; do\
             \n          if opam show -f x-ci-accept-failures: \"$pkg\" | grep -qF \"\\\"debian-12\\\"\"; then\
             \n            echo \"A package failed and has been disabled for CI using the 'x-ci-accept-failures' field.\";\
             \n          fi;\
             \n          test \"$pkg\" != 'ppx_rapper_async.3.1.0' && partial_fails=\"$partial_fails $pkg\";\
             \n        done;\
             \n        test \"${partial_fails}\" != \"\" && echo \"opam-repo-ci detected dependencies failing: ${partial_fails}\";\
             \n        exit 1"))
)

2024-02-11 20:23.56: Waiting for resource in pool OCluster
2024-02-12 20:15.13: Waiting for worker…
2024-02-12 20:16.44: Got resource from pool OCluster
Building on marpe.caelum.ci.dev
All commits already cached
Updating files:  96% (31687/32918)
Updating files:  97% (31931/32918)
Updating files:  98% (32260/32918)
Updating files:  99% (32589/32918)
Updating files: 100% (32918/32918)
Updating files: 100% (32918/32918), done.
HEAD is now at 8477e9a74b Merge pull request #25221 from nberth/mlgmpidl-1.3.0
Updating 8477e9a74b..8c7391d6ec
Fast-forward
 packages/conf-pkg-config/conf-pkg-config.1.0/opam | 2 +-
 packages/conf-pkg-config/conf-pkg-config.1.1/opam | 1 +
 packages/conf-pkg-config/conf-pkg-config.1.2/opam | 1 +
 packages/conf-pkg-config/conf-pkg-config.1.3/opam | 1 +
 packages/conf-pkg-config/conf-pkg-config.2/opam   | 1 +
 packages/conf-pkg-config/conf-pkg-config.3/opam   | 4 +++-
 6 files changed, 8 insertions(+), 2 deletions(-)

(from ocaml/opam:debian-12-ocaml-5.1@sha256:931805f2c2fdb0b5642ae8463ff0780c2ee3f4afb48734a7d94e2d5163429930)
2024-02-12 20:18.00 ---> using "4df7ce52b8e0afe130cbfff7d9b001e43cae58bd8e8710cd073ce7c11b1c6ac8" from cache

/: (user (uid 1000) (gid 1000))

/: (workdir /home/opam)

/home/opam: (run (shell "sudo ln -f /usr/bin/opam-dev /usr/bin/opam"))
2024-02-12 20:18.00 ---> using "2ee14a5dbb7aa54ab1dfa5adba4422c5a5483941525d4174e8eeed0c4c5e97aa" from cache

/home/opam: (run (network host)
                 (shell "opam init --reinit --config .opamrc-sandbox -ni"))
Configuring from /home/opam/.opamrc-sandbox, then /home/opam/.opamrc, and finally from built-in defaults.
Checking for available remotes: rsync and local, git.
  - you won't be able to use mercurial repositories unless you install the hg command on your system.
  - you won't be able to use darcs repositories unless you install the darcs command on your system.

This development version of opam requires an update to the layout of /home/opam/.opam from version 2.0 to version 2.2~alpha, which can't be reverted.
You may want to back it up before going further.

Continue? [y/n] y
[NOTE] The 'jobs' option was reset, its value was 71 and its new value will vary according to the current number of cores on your machine. You can restore the fixed value using:
           opam option jobs=71 --global
Format upgrade done.

<><> Updating repositories ><><><><><><><><><><><><><><><><><><><><><><><><><><>
[default] synchronised from file:///home/opam/opam-repository
2024-02-12 20:18.00 ---> using "d58131e4d084860f74dbebecfc9a35ebb7fbb42cf58093b5ac6cf0adf11ed898" from cache

/home/opam: (env OPAMDOWNLOADJOBS 1)

/home/opam: (env OPAMERRLOGLEN 0)

/home/opam: (env OPAMSOLVERTIMEOUT 500)

/home/opam: (env OPAMPRECISETRACKING 1)

/home/opam: (env CI true)

/home/opam: (env OPAM_REPO_CI true)

/home/opam: (run (shell "rm -rf opam-repository/"))
2024-02-12 20:18.00 ---> using "e76676ee91f5598b65d18de047738848e5af056a75e3436903dc82ff5702c5a6" from cache

/home/opam: (copy (src .) (dst opam-repository/))
2024-02-12 20:18.01 ---> using "00dcf922e87fec2f8ccdd0b44355d41faed143c596db4bfe8812d0e9c5f33f02" from cache

/home/opam: (run (shell "opam repository set-url --strict default opam-repository/"))
[default] Initialised
2024-02-12 20:18.01 ---> using "d6c8604b98b9d01914259989eafdfad7780b6c9f761a469dfe3162a56ba73510" from cache

/home/opam: (run (network host)
                 (shell "opam update --depexts || true"))
+ /usr/bin/sudo "apt-get" "update"
- Get:1 http://deb.debian.org/debian bookworm InRelease [151 kB]
- Get:2 http://deb.debian.org/debian bookworm-updates InRelease [52.1 kB]
- Get:3 http://deb.debian.org/debian-security bookworm-security InRelease [48.0 kB]
- Get:4 http://deb.debian.org/debian bookworm/main amd64 Packages [8786 kB]
- Get:5 http://deb.debian.org/debian-security bookworm-security/main amd64 Packages [137 kB]
- Fetched 9175 kB in 1s (7250 kB/s)
- Reading package lists...
2024-02-12 20:18.01 ---> using "6245d7929b862e6b37f451133c05d21883283d0248743f67197f2e424fe52d69" from cache

/home/opam: (env OPAMCRITERIA -removed,-count[avoid-version,changed],-count[version-lag,request],-count[version-lag,changed],-count[missing-depexts,changed],-changed)

/home/opam: (env OPAMFIXUPCRITERIA -removed,-count[avoid-version,changed],-count[version-lag,request],-count[version-lag,changed],-count[missing-depexts,changed],-changed)

/home/opam: (env OPAMUPGRADECRITERIA -removed,-count[avoid-version,changed],-count[version-lag,request],-count[version-lag,changed],-count[missing-depexts,changed],-changed)

/home/opam: (run (shell "opam pin add -k version -yn conf-pkg-config.1.1 1.1"))
conf-pkg-config is now pinned to version 1.1
2024-02-12 20:18.01 ---> using "efd69474de39398f08b803f28b1c0635d272139b0c33f4b0a322013c52989663" from cache

/home/opam: (run (cache (opam-archives (target /home/opam/.opam/download-cache)))
                 (network host)
                 (shell  "opam reinstall conf-pkg-config.1.1;\
                        \n        res=$?;\
                        \n        test \"$res\" != 31 && exit \"$res\";\
                        \n        export OPAMCLI=2.0;\
                        \n        build_dir=$(opam var prefix)/.opam-switch/build;\
                        \n        failed=$(ls \"$build_dir\");\
                        \n        partial_fails=\"\";\
                        \n        for pkg in $failed; do\
                        \n          if opam show -f x-ci-accept-failures: \"$pkg\" | grep -qF \"\\\"debian-12\\\"\"; then\
                        \n            echo \"A package failed and has been disabled for CI using the 'x-ci-accept-failures' field.\";\
                        \n          fi;\
                        \n          test \"$pkg\" != 'conf-pkg-config.1.1' && partial_fails=\"$partial_fails $pkg\";\
                        \n        done;\
                        \n        test \"${partial_fails}\" != \"\" && echo \"opam-repo-ci detected dependencies failing: ${partial_fails}\";\
                        \n        exit 1"))
conf-pkg-config.1.1 is not installed. Install it? [y/n] y
The following actions will be performed:
=== install 1 package
  - install conf-pkg-config 1.1 (pinned)

The following system packages will first need to be installed:
    pkg-config

<><> Handling external dependencies <><><><><><><><><><><><><><><><><><><><><><>

opam believes some required external dependencies are missing. opam can:
> 1. Run apt-get to install them (may need root/sudo access)
  2. Display the recommended apt-get command and wait while you run it manually (e.g. in another terminal)
  3. Continue anyway, and, upon success, permanently register that this external dependency is present, but not detectable
  4. Abort the installation

[1/2/3/4] 1

+ /usr/bin/sudo "apt-get" "install" "-qq" "-yy" "pkg-config"
- debconf: delaying package configuration, since apt-utils is not installed
- Selecting previously unselected package libpkgconf3:amd64.
- (Reading database ... 
(Reading database ... 5%
(Reading database ... 10%
(Reading database ... 15%
(Reading database ... 20%
(Reading database ... 25%
(Reading database ... 30%
(Reading database ... 35%
(Reading database ... 40%
(Reading database ... 45%
(Reading database ... 50%
(Reading database ... 55%
(Reading database ... 60%
(Reading database ... 65%
(Reading database ... 70%
(Reading database ... 75%
(Reading database ... 80%
(Reading database ... 85%
(Reading database ... 90%
(Reading database ... 95%
(Reading database ... 100%
(Reading database ... 18774 files and directories currently installed.)
- Preparing to unpack .../libpkgconf3_1.8.1-1_amd64.deb ...
- Unpacking libpkgconf3:amd64 (1.8.1-1) ...
- Selecting previously unselected package pkgconf-bin.
- Preparing to unpack .../pkgconf-bin_1.8.1-1_amd64.deb ...
- Unpacking pkgconf-bin (1.8.1-1) ...
- Selecting previously unselected package pkgconf:amd64.
- Preparing to unpack .../pkgconf_1.8.1-1_amd64.deb ...
- Unpacking pkgconf:amd64 (1.8.1-1) ...
- Selecting previously unselected package pkg-config:amd64.
- Preparing to unpack .../pkg-config_1.8.1-1_amd64.deb ...
- Unpacking pkg-config:amd64 (1.8.1-1) ...
- Setting up libpkgconf3:amd64 (1.8.1-1) ...
- Setting up pkgconf-bin (1.8.1-1) ...
- Setting up pkgconf:amd64 (1.8.1-1) ...
- Setting up pkg-config:amd64 (1.8.1-1) ...
- Processing triggers for libc-bin (2.36-9+deb12u4) ...

<><> Processing actions <><><><><><><><><><><><><><><><><><><><><><><><><><><><>
-> installed conf-pkg-config.1.1
Done.
# Run eval $(opam env) to update the current shell environment
2024-02-12 20:18.01 ---> using "0686843ae3c31f38ac5563a3bcd57d9eed648c8dbf66daffdc86057dfb09ccb3" from cache

/home/opam: (env OPAMCRITERIA -removed,-count[avoid-version,changed],-count[version-lag,request],-count[version-lag,changed],-count[missing-depexts,changed],-changed)

/home/opam: (env OPAMFIXUPCRITERIA -removed,-count[avoid-version,changed],-count[version-lag,request],-count[version-lag,changed],-count[missing-depexts,changed],-changed)

/home/opam: (env OPAMUPGRADECRITERIA -removed,-count[avoid-version,changed],-count[version-lag,request],-count[version-lag,changed],-count[missing-depexts,changed],-changed)

/home/opam: (run (cache (opam-archives (target /home/opam/.opam/download-cache)))
                 (network host)
                 (shell  "opam reinstall ppx_rapper_async.3.1.0;\
                        \n        res=$?;\
                        \n        test \"$res\" != 31 && exit \"$res\";\
                        \n        export OPAMCLI=2.0;\
                        \n        build_dir=$(opam var prefix)/.opam-switch/build;\
                        \n        failed=$(ls \"$build_dir\");\
                        \n        partial_fails=\"\";\
                        \n        for pkg in $failed; do\
                        \n          if opam show -f x-ci-accept-failures: \"$pkg\" | grep -qF \"\\\"debian-12\\\"\"; then\
                        \n            echo \"A package failed and has been disabled for CI using the 'x-ci-accept-failures' field.\";\
                        \n          fi;\
                        \n          test \"$pkg\" != 'ppx_rapper_async.3.1.0' && partial_fails=\"$partial_fails $pkg\";\
                        \n        done;\
                        \n        test \"${partial_fails}\" != \"\" && echo \"opam-repo-ci detected dependencies failing: ${partial_fails}\";\
                        \n        exit 1"))
ppx_rapper_async.3.1.0 is not installed. Install it? [y/n] y
The following actions will be performed:
=== install 99 packages
  - install angstrom                    0.16.0  [required by caqti]
  - install async                       v0.16.0 [required by ppx_rapper_async]
  - install async_kernel                v0.16.0 [required by async, caqti-async]
  - install async_rpc_kernel            v0.16.0 [required by async]
  - install async_unix                  v0.16.0 [required by async, caqti-async]
  - install base                        v0.16.3 [required by ppx_rapper]
  - install base_bigstring              v0.16.0 [required by core]
  - install base_quickcheck             v0.16.0 [required by core]
  - install bigarray-compat             1.1.0   [required by ctypes]
  - install bigstringaf                 0.9.1   [required by caqti]
  - install bin_prot                    v0.16.0 [required by core]
  - install caqti                       1.9.0   [required by caqti-async, ppx_rapper]
  - install caqti-async                 1.9.0   [required by ppx_rapper_async]
  - install cmdliner                    1.2.0   [required by pg_query]
  - install conf-libffi                 2.0.0   [required by ctypes-foreign]
  - install core                        v0.16.2 [required by async, caqti-async]
  - install core_kernel                 v0.16.0 [required by async]
  - install core_unix                   v0.16.0 [required by async]
  - install cppo                        1.6.9   [required by caqti]
  - install csexp                       1.5.2   [required by dune-configurator]
  - install ctypes                      0.21.1  [required by pg_query]
  - install ctypes-foreign              0.21.1  [required by pg_query]
  - install dune                        3.13.1  [required by ppx_rapper_async]
  - install dune-configurator           3.13.1  [required by ctypes, ctypes-foreign]
  - install expect_test_helpers_core    v0.16.0 [required by core_unix]
  - install fieldslib                   v0.16.0 [required by core]
  - install int_repr                    v0.16.0 [required by core_kernel]
  - install integers                    0.7.0   [required by ctypes]
  - install jane-street-headers         v0.16.0 [required by core, core_unix]
  - install jst-config                  v0.16.0 [required by core, core_unix]
  - install logs                        0.7.0   [required by caqti]
  - install num                         1.5     [required by sexplib]
  - install ocaml-compiler-libs         v0.12.4 [required by ppxlib]
  - install ocaml-syntax-shims          1.0.0   [required by angstrom]
  - install ocaml_intrinsics            v0.16.0 [required by core_unix]
  - install ocamlbuild                  0.14.3  [required by logs, ptime]
  - install ocamlfind                   1.9.6   [required by ptime, logs, ppx_deriving]
  - install parsexp                     v0.16.0 [required by sexplib]
  - install pg_query                    0.9.7   [required by ppx_rapper]
  - install ppx_assert                  v0.16.0 [required by core]
  - install ppx_base                    v0.16.0 [required by core]
  - install ppx_bench                   v0.16.0 [required by ppx_jane]
  - install ppx_bin_prot                v0.16.0 [required by ppx_jane]
  - install ppx_cold                    v0.16.0 [required by ppx_base]
  - install ppx_compare                 v0.16.0 [required by ppx_base, bin_prot]
  - install ppx_custom_printf           v0.16.0 [required by ppx_jane]
  - install ppx_derivers                1.2.1   [required by ppx_deriving]
  - install ppx_deriving                5.2.1   [required by pg_query]
  - install ppx_disable_unused_warnings v0.16.0 [required by ppx_jane]
  - install ppx_enumerate               v0.16.0 [required by ppx_base]
  - install ppx_expect                  v0.16.0 [required by ppx_jane]
  - install ppx_fields_conv             v0.16.0 [required by ppx_jane]
  - install ppx_fixed_literal           v0.16.0 [required by ppx_jane]
  - install ppx_globalize               v0.16.0 [required by ppx_base]
  - install ppx_hash                    v0.16.0 [required by core]
  - install ppx_here                    v0.16.0 [required by ppx_jane]
  - install ppx_ignore_instrumentation  v0.16.0 [required by ppx_jane]
  - install ppx_inline_test             v0.16.1 [required by core]
  - install ppx_jane                    v0.16.0 [required by async]
  - install ppx_let                     v0.16.0 [required by ppx_jane]
  - install ppx_log                     v0.16.0 [required by async]
  - install ppx_module_timer            v0.16.0 [required by ppx_jane]
  - install ppx_optcomp                 v0.16.0 [required by core_kernel, core, core_unix]
  - install ppx_optional                v0.16.0 [required by ppx_jane]
  - install ppx_pipebang                v0.16.0 [required by ppx_jane]
  - install ppx_rapper                  3.1.0   [required by ppx_rapper_async]
  - install ppx_rapper_async            3.1.0
  - install ppx_sexp_conv               v0.16.0 [required by core]
  - install ppx_sexp_message            v0.16.0 [required by core]
  - install ppx_sexp_value              v0.16.0 [required by ppx_jane]
  - install ppx_stable                  v0.16.0 [required by ppx_jane]
  - install ppx_stable_witness          v0.16.0 [required by ppx_jane]
  - install ppx_string                  v0.16.0 [required by ppx_jane]
  - install ppx_tydi                    v0.16.0 [required by ppx_jane]
  - install ppx_typerep_conv            v0.16.0 [required by ppx_jane]
  - install ppx_variants_conv           v0.16.0 [required by ppx_jane]
  - install ppxlib                      0.32.0  [required by ppx_rapper]
  - install protocol_version_header     v0.16.0 [required by async_rpc_kernel]
  - install ptime                       1.1.0   [required by caqti]
  - install re                          1.11.0  [required by expect_test_helpers_core]
  - install result                      1.5     [required by ppx_deriving]
  - install seq                         base    [required by re]
  - install sexp_pretty                 v0.16.0 [required by expect_test_helpers_core]
  - install sexplib                     v0.16.0 [required by core, core_unix]
  - install sexplib0                    v0.16.0 [required by base]
  - install spawn                       v0.15.1 [required by core_unix]
  - install splittable_random           v0.16.0 [required by core]
  - install stdio                       v0.16.0 [required by core]
  - install stdlib-shims                0.3.0   [required by integers]
  - install stringext                   1.6.0   [required by uri]
  - install textutils                   v0.16.0 [required by async]
  - install textutils_kernel            v0.16.0 [required by textutils]
  - install time_now                    v0.16.0 [required by core]
  - install timezone                    v0.16.0 [required by core_unix]
  - install topkg                       1.0.7   [required by logs, ptime]
  - install typerep                     v0.16.0 [required by core]
  - install uri                         4.4.0   [required by caqti]
  - install uutf                        1.0.3   [required by textutils]
  - install variantslib                 v0.16.0 [required by core]

The following system packages will first need to be installed:
    libffi-dev

<><> Handling external dependencies <><><><><><><><><><><><><><><><><><><><><><>

opam believes some required external dependencies are missing. opam can:
> 1. Run apt-get to install them (may need root/sudo access)
  2. Display the recommended apt-get command and wait while you run it manually (e.g. in another terminal)
  3. Continue anyway, and, upon success, permanently register that this external dependency is present, but not detectable
  4. Abort the installation

[1/2/3/4] 1

+ /usr/bin/sudo "apt-get" "install" "-qq" "-yy" "libffi-dev"
- debconf: delaying package configuration, since apt-utils is not installed
- Selecting previously unselected package libffi-dev:amd64.
- (Reading database ... 
(Reading database ... 5%
(Reading database ... 10%
(Reading database ... 15%
(Reading database ... 20%
(Reading database ... 25%
(Reading database ... 30%
(Reading database ... 35%
(Reading database ... 40%
(Reading database ... 45%
(Reading database ... 50%
(Reading database ... 55%
(Reading database ... 60%
(Reading database ... 65%
(Reading database ... 70%
(Reading database ... 75%
(Reading database ... 80%
(Reading database ... 85%
(Reading database ... 90%
(Reading database ... 95%
(Reading database ... 100%
(Reading database ... 18810 files and directories currently installed.)
- Preparing to unpack .../libffi-dev_3.4.4-1_amd64.deb ...
- Unpacking libffi-dev:amd64 (3.4.4-1) ...
- Setting up libffi-dev:amd64 (3.4.4-1) ...

<><> Processing actions <><><><><><><><><><><><><><><><><><><><><><><><><><><><>
-> retrieved angstrom.0.16.0  (cached)
-> retrieved async.v0.16.0  (cached)
-> retrieved async_kernel.v0.16.0  (cached)
-> retrieved async_rpc_kernel.v0.16.0  (cached)
-> retrieved async_unix.v0.16.0  (cached)
-> retrieved base.v0.16.3  (cached)
-> retrieved base_bigstring.v0.16.0  (cached)
-> retrieved base_quickcheck.v0.16.0  (cached)
-> retrieved bigarray-compat.1.1.0  (cached)
-> retrieved bigstringaf.0.9.1  (cached)
-> retrieved bin_prot.v0.16.0  (cached)
-> retrieved caqti.1.9.0, caqti-async.1.9.0  (cached)
-> retrieved cmdliner.1.2.0  (cached)
-> retrieved core.v0.16.2  (cached)
-> installed conf-libffi.2.0.0
-> retrieved core_kernel.v0.16.0  (cached)
-> retrieved core_unix.v0.16.0  (cached)
-> retrieved cppo.1.6.9  (cached)
-> retrieved csexp.1.5.2  (cached)
-> retrieved ctypes.0.21.1, ctypes-foreign.0.21.1  (cached)
-> retrieved dune.3.13.1, dune-configurator.3.13.1  (cached)
-> retrieved expect_test_helpers_core.v0.16.0  (cached)
-> retrieved fieldslib.v0.16.0  (cached)
-> retrieved int_repr.v0.16.0  (cached)
-> retrieved integers.0.7.0  (cached)
-> retrieved jane-street-headers.v0.16.0  (cached)
-> retrieved jst-config.v0.16.0  (cached)
-> retrieved logs.0.7.0  (cached)
-> retrieved num.1.5  (cached)
-> retrieved ocaml-compiler-libs.v0.12.4  (cached)
-> retrieved ocaml-syntax-shims.1.0.0  (cached)
-> retrieved ocaml_intrinsics.v0.16.0  (cached)
-> retrieved ocamlbuild.0.14.3  (cached)
-> installed cmdliner.1.2.0
-> retrieved ocamlfind.1.9.6  (cached)
-> retrieved parsexp.v0.16.0  (cached)
-> retrieved pg_query.0.9.7  (cached)
-> retrieved ppx_assert.v0.16.0  (cached)
-> retrieved ppx_base.v0.16.0  (cached)
-> retrieved ppx_bench.v0.16.0  (cached)
-> retrieved ppx_bin_prot.v0.16.0  (cached)
-> retrieved ppx_cold.v0.16.0  (cached)
-> retrieved ppx_compare.v0.16.0  (cached)
-> retrieved ppx_custom_printf.v0.16.0  (cached)
-> retrieved ppx_derivers.1.2.1  (cached)
-> retrieved ppx_deriving.5.2.1  (cached)
-> retrieved ppx_disable_unused_warnings.v0.16.0  (cached)
-> retrieved ppx_enumerate.v0.16.0  (cached)
-> retrieved ppx_expect.v0.16.0  (cached)
-> retrieved ppx_fields_conv.v0.16.0  (cached)
-> retrieved ppx_fixed_literal.v0.16.0  (cached)
-> retrieved ppx_globalize.v0.16.0  (cached)
-> retrieved ppx_hash.v0.16.0  (cached)
-> retrieved ppx_here.v0.16.0  (cached)
-> retrieved ppx_ignore_instrumentation.v0.16.0  (cached)
-> retrieved ppx_inline_test.v0.16.1  (cached)
-> retrieved ppx_jane.v0.16.0  (cached)
-> retrieved ppx_let.v0.16.0  (cached)
-> retrieved ppx_log.v0.16.0  (cached)
-> retrieved ppx_module_timer.v0.16.0  (cached)
-> retrieved ppx_optcomp.v0.16.0  (cached)
-> retrieved ppx_optional.v0.16.0  (cached)
-> retrieved ppx_pipebang.v0.16.0  (cached)
-> retrieved ppx_rapper.3.1.0, ppx_rapper_async.3.1.0  (cached)
-> retrieved ppx_sexp_conv.v0.16.0  (cached)
-> retrieved ppx_sexp_message.v0.16.0  (cached)
-> retrieved ppx_sexp_value.v0.16.0  (cached)
-> retrieved ppx_stable.v0.16.0  (cached)
-> retrieved ppx_stable_witness.v0.16.0  (cached)
-> retrieved ppx_string.v0.16.0  (cached)
-> retrieved ppx_tydi.v0.16.0  (cached)
-> retrieved ppx_typerep_conv.v0.16.0  (cached)
-> retrieved ppx_variants_conv.v0.16.0  (cached)
-> retrieved ppxlib.0.32.0  (cached)
-> retrieved protocol_version_header.v0.16.0  (cached)
-> retrieved ptime.1.1.0  (cached)
-> retrieved re.1.11.0  (cached)
-> retrieved result.1.5  (cached)
-> installed seq.base
-> retrieved sexp_pretty.v0.16.0  (cached)
-> retrieved sexplib.v0.16.0  (cached)
-> retrieved sexplib0.v0.16.0  (cached)
-> retrieved spawn.v0.15.1  (cached)
-> retrieved splittable_random.v0.16.0  (cached)
-> retrieved stdio.v0.16.0  (cached)
-> retrieved stdlib-shims.0.3.0  (cached)
-> retrieved stringext.1.6.0  (cached)
-> retrieved textutils.v0.16.0  (cached)
-> retrieved textutils_kernel.v0.16.0  (cached)
-> retrieved time_now.v0.16.0  (cached)
-> retrieved timezone.v0.16.0  (cached)
-> retrieved topkg.1.0.7  (cached)
-> retrieved typerep.v0.16.0  (cached)
-> retrieved uri.4.4.0  (cached)
-> retrieved uutf.1.0.3  (cached)
-> retrieved variantslib.v0.16.0  (cached)
-> installed num.1.5
-> installed ocamlfind.1.9.6
-> installed ocamlbuild.0.14.3
-> installed topkg.1.0.7
-> installed logs.0.7.0
-> installed uutf.1.0.3
-> installed ptime.1.1.0
-> installed dune.3.13.1
-> installed jane-street-headers.v0.16.0
-> installed csexp.1.5.2
-> installed bigarray-compat.1.1.0
-> installed ppx_derivers.1.2.1
-> installed re.1.11.0
-> installed cppo.1.6.9
-> installed ocaml-syntax-shims.1.0.0
-> installed ocaml-compiler-libs.v0.12.4
-> installed result.1.5
-> installed sexplib0.v0.16.0
-> installed spawn.v0.15.1
-> installed stdlib-shims.0.3.0
-> installed stringext.1.6.0
-> installed integers.0.7.0
-> installed parsexp.v0.16.0
-> installed dune-configurator.3.13.1
-> installed bigstringaf.0.9.1
-> installed sexplib.v0.16.0
-> installed angstrom.0.16.0
-> installed ocaml_intrinsics.v0.16.0
-> installed uri.4.4.0
-> installed caqti.1.9.0
-> installed base.v0.16.3
-> installed ctypes.0.21.1
-> installed fieldslib.v0.16.0
-> installed variantslib.v0.16.0
-> installed stdio.v0.16.0
-> installed typerep.v0.16.0
-> installed ctypes-foreign.0.21.1
-> installed ppxlib.0.32.0
-> installed ppx_globalize.v0.16.0
-> installed ppx_optcomp.v0.16.0
-> installed ppx_cold.v0.16.0
-> installed ppx_enumerate.v0.16.0
-> installed ppx_tydi.v0.16.0
-> installed ppx_compare.v0.16.0
-> installed ppx_disable_unused_warnings.v0.16.0
-> installed ppx_here.v0.16.0
-> installed ppx_typerep_conv.v0.16.0
-> installed ppx_stable_witness.v0.16.0
-> installed ppx_variants_conv.v0.16.0
-> installed ppx_stable.v0.16.0
-> installed ppx_fields_conv.v0.16.0
-> installed ppx_pipebang.v0.16.0
-> installed ppx_ignore_instrumentation.v0.16.0
-> installed ppx_optional.v0.16.0
-> installed ppx_fixed_literal.v0.16.0
-> installed ppx_sexp_conv.v0.16.0
-> installed ppx_deriving.5.2.1
-> installed ppx_let.v0.16.0
-> installed ppx_hash.v0.16.0
-> installed ppx_assert.v0.16.0
-> installed ppx_sexp_value.v0.16.0
-> installed ppx_sexp_message.v0.16.0
-> installed ppx_custom_printf.v0.16.0
-> installed ppx_base.v0.16.0
-> installed jst-config.v0.16.0
-> installed ppx_log.v0.16.0
-> installed sexp_pretty.v0.16.0
-> installed bin_prot.v0.16.0
-> installed ppx_string.v0.16.0
-> installed time_now.v0.16.0
-> installed ppx_bin_prot.v0.16.0
-> installed ppx_module_timer.v0.16.0
-> installed ppx_inline_test.v0.16.1
-> installed ppx_bench.v0.16.0
-> installed ppx_expect.v0.16.0
-> installed splittable_random.v0.16.0
-> installed base_quickcheck.v0.16.0
-> installed ppx_jane.v0.16.0
-> installed int_repr.v0.16.0
-> installed base_bigstring.v0.16.0
-> installed core.v0.16.2
-> installed protocol_version_header.v0.16.0
-> installed textutils_kernel.v0.16.0
-> installed timezone.v0.16.0
-> installed expect_test_helpers_core.v0.16.0
-> installed core_kernel.v0.16.0
-> installed pg_query.0.9.7
-> installed async_kernel.v0.16.0
-> installed ppx_rapper.3.1.0
-> installed core_unix.v0.16.0
-> installed textutils.v0.16.0
-> installed async_rpc_kernel.v0.16.0
-> installed async_unix.v0.16.0
-> installed caqti-async.1.9.0
-> installed async.v0.16.0
-> installed ppx_rapper_async.3.1.0
Done.
# Run eval $(opam env) to update the current shell environment
2024-02-12 20:19.53 ---> saved as "dd27364ec4bd56bb5fc4e9a56ba1a47778e97ca0f2e3f8c53ecac9f4c28c4817"

/home/opam: (env OPAMCRITERIA -removed,-count[avoid-version,changed],-count[version-lag,request],-count[version-lag,changed],-count[missing-depexts,changed],-changed)

/home/opam: (env OPAMFIXUPCRITERIA -removed,-count[avoid-version,changed],-count[version-lag,request],-count[version-lag,changed],-count[missing-depexts,changed],-changed)

/home/opam: (env OPAMUPGRADECRITERIA -removed,-count[avoid-version,changed],-count[version-lag,request],-count[version-lag,changed],-count[missing-depexts,changed],-changed)

/home/opam: (run (network host)
                 (shell "(opam reinstall --with-test ppx_rapper_async.3.1.0) || true"))
The following actions will be performed:
=== recompile 1 package
  - recompile ppx_rapper_async 3.1.0

<><> Processing actions <><><><><><><><><><><><><><><><><><><><><><><><><><><><>
-> retrieved ppx_rapper_async.3.1.0  (https://raw.githubusercontent.com/ocaml/opam-source-archives/HEAD/ppx_rapper-3.1.0.tar.gz)
[ERROR] The compilation of ppx_rapper_async.3.1.0 failed at "dune build -p ppx_rapper_async -j 255 @install @runtest".

#=== ERROR while compiling ppx_rapper_async.3.1.0 =============================#
# context              2.2.0~beta2~dev | linux/x86_64 | ocaml-base-compiler.5.1.1 | file:///home/opam/opam-repository
# path                 ~/.opam/5.1/.opam-switch/build/ppx_rapper_async.3.1.0
# command              ~/.opam/opam-init/hooks/sandbox.sh build dune build -p ppx_rapper_async -j 255 @install @runtest
# exit-code            1
# env-file             ~/.opam/log/ppx_rapper_async-8-8507f6.env
# output-file          ~/.opam/log/ppx_rapper_async-8-8507f6.out
### output ###
# File "test/ppx/test.expected.ml", line 1, characters 0-0:
# /usr/bin/git --no-pager diff --no-index --color=always -u _build/default/test/ppx/test.expected.ml _build/default/test/ppx/test.actual.ml
# diff --git a/_build/default/test/ppx/test.expected.ml b/_build/default/test/ppx/test.actual.ml
# index 974f691..f843df6 100644
# --- a/_build/default/test/ppx/test.expected.ml
# +++ b/_build/default/test/ppx/test.actual.ml
# @@ -220,7 +220,8 @@ let list =
#                       [@ocaml.warning "-33"]) item pack) Dynparam.empty elems in
#            let query =
#              Caqti_request.Infix.(->?) ~oneshot:true
# -              (let open Caqti_type in tup2 bool packed_list_type)
# +              ((let open Caqti_type in tup2 bool packed_list_type)
# +              [@ocaml.warning "-33"])
#                ((let open Caqti_type in
#                    tup2 int (tup2 string (tup2 bool (option string))))
#                [@ocaml.warning "-33"]) sql in
# @@ -256,8 +257,9 @@ let collect_list =
#                     Dynparam.add ((let open Caqti_type in int)
#                       [@ocaml.warning "-33"]) item pack) Dynparam.empty elems in
#            let query =
# -            Caqti_request.Infix.( ->* ) ~oneshot:true packed_list_type
# -              ((let open Caqti_type in string)[@ocaml.warning "-33"]) sql in
# +            Caqti_request.Infix.( ->* ) ~oneshot:true ((packed_list_type)
# +              [@ocaml.warning "-33"]) ((let open Caqti_type in string)
# +              [@ocaml.warning "-33"]) sql in
#            Db.collect_list query versions in
#    wrapped
#  module Suit : Ppx_rapper_runtime.CUSTOM =



<><> Error report <><><><><><><><><><><><><><><><><><><><><><><><><><><><><><><>
+- The following actions failed
| - build ppx_rapper_async 3.1.0
+- 
- No changes have been performed
# Run eval $(opam env) to update the current shell environment
2024-02-12 20:20.05 ---> saved as "def89f1a31d554a6b58650a6733e11c252fc1953a340606db9dbe5e450604ed1"

/home/opam: (run (shell  "opam reinstall --with-test --verbose ppx_rapper_async.3.1.0;\
                        \n        res=$?;\
                        \n        test \"$res\" != 31 && exit \"$res\";\
                        \n        export OPAMCLI=2.0;\
                        \n        build_dir=$(opam var prefix)/.opam-switch/build;\
                        \n        failed=$(ls \"$build_dir\");\
                        \n        partial_fails=\"\";\
                        \n        for pkg in $failed; do\
                        \n          if opam show -f x-ci-accept-failures: \"$pkg\" | grep -qF \"\\\"debian-12\\\"\"; then\
                        \n            echo \"A package failed and has been disabled for CI using the 'x-ci-accept-failures' field.\";\
                        \n          fi;\
                        \n          test \"$pkg\" != 'ppx_rapper_async.3.1.0' && partial_fails=\"$partial_fails $pkg\";\
                        \n        done;\
                        \n        test \"${partial_fails}\" != \"\" && echo \"opam-repo-ci detected dependencies failing: ${partial_fails}\";\
                        \n        exit 1"))
The following actions will be performed:
=== recompile 1 package
  - recompile ppx_rapper_async 3.1.0

<><> Processing actions <><><><><><><><><><><><><><><><><><><><><><><><><><><><>
Processing  1/4:
-> retrieved ppx_rapper_async.3.1.0  (cached)
Processing  2/4: [ppx_rapper_async: dune build]
+ /home/opam/.opam/opam-init/hooks/sandbox.sh "build" "dune" "build" "-p" "ppx_rapper_async" "-j" "255" "@install" "@runtest" (CWD=/home/opam/.opam/5.1/.opam-switch/build/ppx_rapper_async.3.1.0)
- File "test/ppx/test.expected.ml", line 1, characters 0-0:
- /usr/bin/git --no-pager diff --no-index --color=always -u _build/default/test/ppx/test.expected.ml _build/default/test/ppx/test.actual.ml
- diff --git a/_build/default/test/ppx/test.expected.ml b/_build/default/test/ppx/test.actual.ml
- index 974f691..f843df6 100644
- --- a/_build/default/test/ppx/test.expected.ml
- +++ b/_build/default/test/ppx/test.actual.ml
- @@ -220,7 +220,8 @@ let list =
-                       [@ocaml.warning "-33"]) item pack) Dynparam.empty elems in
-            let query =
-              Caqti_request.Infix.(->?) ~oneshot:true
- -              (let open Caqti_type in tup2 bool packed_list_type)
- +              ((let open Caqti_type in tup2 bool packed_list_type)
- +              [@ocaml.warning "-33"])
-                ((let open Caqti_type in
-                    tup2 int (tup2 string (tup2 bool (option string))))
-                [@ocaml.warning "-33"]) sql in
- @@ -256,8 +257,9 @@ let collect_list =
-                     Dynparam.add ((let open Caqti_type in int)
-                       [@ocaml.warning "-33"]) item pack) Dynparam.empty elems in
-            let query =
- -            Caqti_request.Infix.( ->* ) ~oneshot:true packed_list_type
- -              ((let open Caqti_type in string)[@ocaml.warning "-33"]) sql in
- +            Caqti_request.Infix.( ->* ) ~oneshot:true ((packed_list_type)
- +              [@ocaml.warning "-33"]) ((let open Caqti_type in string)
- +              [@ocaml.warning "-33"]) sql in
-            Db.collect_list query versions in
-    wrapped
-  module Suit : Ppx_rapper_runtime.CUSTOM =
[ERROR] The compilation of ppx_rapper_async.3.1.0 failed at "dune build -p ppx_rapper_async -j 255 @install @runtest".

#=== ERROR while compiling ppx_rapper_async.3.1.0 =============================#
# context              2.2.0~beta2~dev | linux/x86_64 | ocaml-base-compiler.5.1.1 | file:///home/opam/opam-repository
# path                 ~/.opam/5.1/.opam-switch/build/ppx_rapper_async.3.1.0
# command              ~/.opam/opam-init/hooks/sandbox.sh build dune build -p ppx_rapper_async -j 255 @install @runtest
# exit-code            1
# env-file             ~/.opam/log/ppx_rapper_async-7-fc4a03.env
# output-file          ~/.opam/log/ppx_rapper_async-7-fc4a03.out
### output ###
# File "test/ppx/test.expected.ml", line 1, characters 0-0:
# /usr/bin/git --no-pager diff --no-index --color=always -u _build/default/test/ppx/test.expected.ml _build/default/test/ppx/test.actual.ml
# diff --git a/_build/default/test/ppx/test.expected.ml b/_build/default/test/ppx/test.actual.ml
# index 974f691..f843df6 100644
# --- a/_build/default/test/ppx/test.expected.ml
# +++ b/_build/default/test/ppx/test.actual.ml
# @@ -220,7 +220,8 @@ let list =
#                       [@ocaml.warning "-33"]) item pack) Dynparam.empty elems in
#            let query =
#              Caqti_request.Infix.(->?) ~oneshot:true
# -              (let open Caqti_type in tup2 bool packed_list_type)
# +              ((let open Caqti_type in tup2 bool packed_list_type)
# +              [@ocaml.warning "-33"])
#                ((let open Caqti_type in
#                    tup2 int (tup2 string (tup2 bool (option string))))
#                [@ocaml.warning "-33"]) sql in
# @@ -256,8 +257,9 @@ let collect_list =
#                     Dynparam.add ((let open Caqti_type in int)
#                       [@ocaml.warning "-33"]) item pack) Dynparam.empty elems in
#            let query =
# -            Caqti_request.Infix.( ->* ) ~oneshot:true packed_list_type
# -              ((let open Caqti_type in string)[@ocaml.warning "-33"]) sql in
# +            Caqti_request.Infix.( ->* ) ~oneshot:true ((packed_list_type)
# +              [@ocaml.warning "-33"]) ((let open Caqti_type in string)
# +              [@ocaml.warning "-33"]) sql in
#            Db.collect_list query versions in
#    wrapped
#  module Suit : Ppx_rapper_runtime.CUSTOM =



<><> Error report <><><><><><><><><><><><><><><><><><><><><><><><><><><><><><><>
+- The following actions failed
| - build ppx_rapper_async 3.1.0
+- 
- No changes have been performed
# Run eval $(opam env) to update the current shell environment
'opam reinstall --with-test --verbose ppx_rapper_async.3.1.0' failed.
[WARNING] OPAMCONFIRMLEVEL was ignored because CLI 2.0 was requested and it was introduced in 2.1.
[WARNING] OPAMCONFIRMLEVEL was ignored because CLI 2.0 was requested and it was introduced in 2.1.
"/usr/bin/env" "bash" "-c" "opam reinstall --with-test --verbose ppx_rapper_async.3.1.0;
        res=$?;
        test "$res" != 31 && exit "$res";
        export OPAMCLI=2.0;
        build_dir=$(opam var prefix)/.opam-switch/build;
        failed=$(ls "$build_dir");
        partial_fails="";
        for pkg in $failed; do
          if opam show -f x-ci-accept-failures: "$pkg" | grep -qF "\"debian-12\""; then
            echo "A package failed and has been disabled for CI using the 'x-ci-accept-failures' field.";
          fi;
          test "$pkg" != 'ppx_rapper_async.3.1.0' && partial_fails="$partial_fails $pkg";
        done;
        test "${partial_fails}" != "" && echo "opam-repo-ci detected dependencies failing: ${partial_fails}";
        exit 1" failed with exit status 1
2024-02-12 20:20.31: Job failed: Failed: Build failed
2024-02-12 20:20.31: Log analysis:
2024-02-12 20:20.31: >>> 
[ERROR] The compilation of ppx_rapper_async.3.1.0 failed at "dune build -p ppx_rapper_async -j 255 @install @runtest".
 (score = 20)
2024-02-12 20:20.31: >>> 
[ERROR] The compilation of ppx_rapper_async.3.1.0 failed at "dune build -p ppx_rapper_async -j 255 @install @runtest".
 (score = 20)
2024-02-12 20:20.31: The compilation of ppx_rapper_async.3.1.0 failed at "dune build -p ppx_rapper_async -j 255 @install @runtest".