Build:
  1. 0
2024-02-11 20:23.54: New job: test solo5-bindings-hvt.0.6.6 with conf-pkg-config.1.1, using opam dev
                              from https://github.com/ocaml/opam-repository.git#refs/pull/25235/head (8c7391d6ec81e93f24de221eb32a886b72d1ede6)
                              on debian-12-ocaml-5.1/amd64

To reproduce locally:

cd $(mktemp -d)
git clone --recursive "https://github.com/ocaml/opam-repository.git" && cd "opam-repository" && git fetch origin "refs/pull/25235/head" && git reset --hard 8c7391d6
git fetch origin master
git merge --no-edit 8477e9a74beb40d85534ab7653b65d45607a147f
cat > ../Dockerfile <<'END-OF-DOCKERFILE'
FROM ocaml/opam:debian-12-ocaml-5.1@sha256:931805f2c2fdb0b5642ae8463ff0780c2ee3f4afb48734a7d94e2d5163429930
USER 1000:1000
WORKDIR /home/opam
RUN sudo ln -f /usr/bin/opam-dev /usr/bin/opam
RUN opam init --reinit -ni
ENV OPAMDOWNLOADJOBS="1"
ENV OPAMERRLOGLEN="0"
ENV OPAMSOLVERTIMEOUT="500"
ENV OPAMPRECISETRACKING="1"
ENV CI="true"
ENV OPAM_REPO_CI="true"
RUN rm -rf opam-repository/
COPY --chown=1000:1000 . opam-repository/
RUN opam repository set-url --strict default opam-repository/
RUN opam update --depexts || true
ENV OPAMCRITERIA="-removed,-count[avoid-version,changed],-count[version-lag,request],-count[version-lag,changed],-count[missing-depexts,changed],-changed"
ENV OPAMFIXUPCRITERIA="-removed,-count[avoid-version,changed],-count[version-lag,request],-count[version-lag,changed],-count[missing-depexts,changed],-changed"
ENV OPAMUPGRADECRITERIA="-removed,-count[avoid-version,changed],-count[version-lag,request],-count[version-lag,changed],-count[missing-depexts,changed],-changed"
RUN opam pin add -k version -yn conf-pkg-config.1.1 1.1
RUN opam reinstall conf-pkg-config.1.1; \
    res=$?; \
    test "$res" != 31 && exit "$res"; \
    export OPAMCLI=2.0; \
    build_dir=$(opam var prefix)/.opam-switch/build; \
    failed=$(ls "$build_dir"); \
    partial_fails=""; \
    for pkg in $failed; do \
    if opam show -f x-ci-accept-failures: "$pkg" | grep -qF "\"debian-12\""; then \
    echo "A package failed and has been disabled for CI using the 'x-ci-accept-failures' field."; \
    fi; \
    test "$pkg" != 'conf-pkg-config.1.1' && partial_fails="$partial_fails $pkg"; \
    done; \
    test "${partial_fails}" != "" && echo "opam-repo-ci detected dependencies failing: ${partial_fails}"; \
    exit 1
ENV OPAMCRITERIA="-removed,-count[avoid-version,changed],-count[version-lag,request],-count[version-lag,changed],-count[missing-depexts,changed],-changed"
ENV OPAMFIXUPCRITERIA="-removed,-count[avoid-version,changed],-count[version-lag,request],-count[version-lag,changed],-count[missing-depexts,changed],-changed"
ENV OPAMUPGRADECRITERIA="-removed,-count[avoid-version,changed],-count[version-lag,request],-count[version-lag,changed],-count[missing-depexts,changed],-changed"
RUN opam reinstall solo5-bindings-hvt.0.6.6; \
    res=$?; \
    test "$res" != 31 && exit "$res"; \
    export OPAMCLI=2.0; \
    build_dir=$(opam var prefix)/.opam-switch/build; \
    failed=$(ls "$build_dir"); \
    partial_fails=""; \
    for pkg in $failed; do \
    if opam show -f x-ci-accept-failures: "$pkg" | grep -qF "\"debian-12\""; then \
    echo "A package failed and has been disabled for CI using the 'x-ci-accept-failures' field."; \
    fi; \
    test "$pkg" != 'solo5-bindings-hvt.0.6.6' && partial_fails="$partial_fails $pkg"; \
    done; \
    test "${partial_fails}" != "" && echo "opam-repo-ci detected dependencies failing: ${partial_fails}"; \
    exit 1
ENV OPAMCRITERIA="-removed,-count[avoid-version,changed],-count[version-lag,request],-count[version-lag,changed],-count[missing-depexts,changed],-changed"
ENV OPAMFIXUPCRITERIA="-removed,-count[avoid-version,changed],-count[version-lag,request],-count[version-lag,changed],-count[missing-depexts,changed],-changed"
ENV OPAMUPGRADECRITERIA="-removed,-count[avoid-version,changed],-count[version-lag,request],-count[version-lag,changed],-count[missing-depexts,changed],-changed"
RUN (opam reinstall --with-test solo5-bindings-hvt.0.6.6) || true
RUN opam reinstall --with-test --verbose solo5-bindings-hvt.0.6.6; \
    res=$?; \
    test "$res" != 31 && exit "$res"; \
    export OPAMCLI=2.0; \
    build_dir=$(opam var prefix)/.opam-switch/build; \
    failed=$(ls "$build_dir"); \
    partial_fails=""; \
    for pkg in $failed; do \
    if opam show -f x-ci-accept-failures: "$pkg" | grep -qF "\"debian-12\""; then \
    echo "A package failed and has been disabled for CI using the 'x-ci-accept-failures' field."; \
    fi; \
    test "$pkg" != 'solo5-bindings-hvt.0.6.6' && partial_fails="$partial_fails $pkg"; \
    done; \
    test "${partial_fails}" != "" && echo "opam-repo-ci detected dependencies failing: ${partial_fails}"; \
    exit 1

END-OF-DOCKERFILE
docker build -f ../Dockerfile .

2024-02-11 20:23.54: Using cache hint "ocaml/opam:debian-12-ocaml-5.1@sha256:931805f2c2fdb0b5642ae8463ff0780c2ee3f4afb48734a7d94e2d5163429930-conf-pkg-config.1.1-solo5-bindings-hvt.0.6.6-8c7391d6ec81e93f24de221eb32a886b72d1ede6"
2024-02-11 20:23.54: Using OBuilder spec:
((from ocaml/opam:debian-12-ocaml-5.1@sha256:931805f2c2fdb0b5642ae8463ff0780c2ee3f4afb48734a7d94e2d5163429930)
 (user (uid 1000) (gid 1000))
 (workdir /home/opam)
 (run (shell "sudo ln -f /usr/bin/opam-dev /usr/bin/opam"))
 (run (network host)
      (shell "opam init --reinit --config .opamrc-sandbox -ni"))
 (env OPAMDOWNLOADJOBS 1)
 (env OPAMERRLOGLEN 0)
 (env OPAMSOLVERTIMEOUT 500)
 (env OPAMPRECISETRACKING 1)
 (env CI true)
 (env OPAM_REPO_CI true)
 (run (shell "rm -rf opam-repository/"))
 (copy (src .) (dst opam-repository/))
 (run (shell "opam repository set-url --strict default opam-repository/"))
 (run (network host)
      (shell "opam update --depexts || true"))
 (env OPAMCRITERIA -removed,-count[avoid-version,changed],-count[version-lag,request],-count[version-lag,changed],-count[missing-depexts,changed],-changed)
 (env OPAMFIXUPCRITERIA -removed,-count[avoid-version,changed],-count[version-lag,request],-count[version-lag,changed],-count[missing-depexts,changed],-changed)
 (env OPAMUPGRADECRITERIA -removed,-count[avoid-version,changed],-count[version-lag,request],-count[version-lag,changed],-count[missing-depexts,changed],-changed)
 (run (shell "opam pin add -k version -yn conf-pkg-config.1.1 1.1"))
 (run (cache (opam-archives (target /home/opam/.opam/download-cache)))
      (network host)
      (shell  "opam reinstall conf-pkg-config.1.1;\
             \n        res=$?;\
             \n        test \"$res\" != 31 && exit \"$res\";\
             \n        export OPAMCLI=2.0;\
             \n        build_dir=$(opam var prefix)/.opam-switch/build;\
             \n        failed=$(ls \"$build_dir\");\
             \n        partial_fails=\"\";\
             \n        for pkg in $failed; do\
             \n          if opam show -f x-ci-accept-failures: \"$pkg\" | grep -qF \"\\\"debian-12\\\"\"; then\
             \n            echo \"A package failed and has been disabled for CI using the 'x-ci-accept-failures' field.\";\
             \n          fi;\
             \n          test \"$pkg\" != 'conf-pkg-config.1.1' && partial_fails=\"$partial_fails $pkg\";\
             \n        done;\
             \n        test \"${partial_fails}\" != \"\" && echo \"opam-repo-ci detected dependencies failing: ${partial_fails}\";\
             \n        exit 1"))
 (env OPAMCRITERIA -removed,-count[avoid-version,changed],-count[version-lag,request],-count[version-lag,changed],-count[missing-depexts,changed],-changed)
 (env OPAMFIXUPCRITERIA -removed,-count[avoid-version,changed],-count[version-lag,request],-count[version-lag,changed],-count[missing-depexts,changed],-changed)
 (env OPAMUPGRADECRITERIA -removed,-count[avoid-version,changed],-count[version-lag,request],-count[version-lag,changed],-count[missing-depexts,changed],-changed)
 (run (cache (opam-archives (target /home/opam/.opam/download-cache)))
      (network host)
      (shell  "opam reinstall solo5-bindings-hvt.0.6.6;\
             \n        res=$?;\
             \n        test \"$res\" != 31 && exit \"$res\";\
             \n        export OPAMCLI=2.0;\
             \n        build_dir=$(opam var prefix)/.opam-switch/build;\
             \n        failed=$(ls \"$build_dir\");\
             \n        partial_fails=\"\";\
             \n        for pkg in $failed; do\
             \n          if opam show -f x-ci-accept-failures: \"$pkg\" | grep -qF \"\\\"debian-12\\\"\"; then\
             \n            echo \"A package failed and has been disabled for CI using the 'x-ci-accept-failures' field.\";\
             \n          fi;\
             \n          test \"$pkg\" != 'solo5-bindings-hvt.0.6.6' && partial_fails=\"$partial_fails $pkg\";\
             \n        done;\
             \n        test \"${partial_fails}\" != \"\" && echo \"opam-repo-ci detected dependencies failing: ${partial_fails}\";\
             \n        exit 1"))
 (env OPAMCRITERIA -removed,-count[avoid-version,changed],-count[version-lag,request],-count[version-lag,changed],-count[missing-depexts,changed],-changed)
 (env OPAMFIXUPCRITERIA -removed,-count[avoid-version,changed],-count[version-lag,request],-count[version-lag,changed],-count[missing-depexts,changed],-changed)
 (env OPAMUPGRADECRITERIA -removed,-count[avoid-version,changed],-count[version-lag,request],-count[version-lag,changed],-count[missing-depexts,changed],-changed)
 (run (network host)
      (shell "(opam reinstall --with-test solo5-bindings-hvt.0.6.6) || true"))
 (run (shell  "opam reinstall --with-test --verbose solo5-bindings-hvt.0.6.6;\
             \n        res=$?;\
             \n        test \"$res\" != 31 && exit \"$res\";\
             \n        export OPAMCLI=2.0;\
             \n        build_dir=$(opam var prefix)/.opam-switch/build;\
             \n        failed=$(ls \"$build_dir\");\
             \n        partial_fails=\"\";\
             \n        for pkg in $failed; do\
             \n          if opam show -f x-ci-accept-failures: \"$pkg\" | grep -qF \"\\\"debian-12\\\"\"; then\
             \n            echo \"A package failed and has been disabled for CI using the 'x-ci-accept-failures' field.\";\
             \n          fi;\
             \n          test \"$pkg\" != 'solo5-bindings-hvt.0.6.6' && partial_fails=\"$partial_fails $pkg\";\
             \n        done;\
             \n        test \"${partial_fails}\" != \"\" && echo \"opam-repo-ci detected dependencies failing: ${partial_fails}\";\
             \n        exit 1"))
)

2024-02-11 20:23.54: Waiting for resource in pool OCluster
2024-02-12 20:05.36: Waiting for worker…
2024-02-12 20:07.00: Got resource from pool OCluster
Building on x86-bm-c7.sw.ocaml.org
All commits already cached
Updating files:  58% (19412/32918)
Updating files:  59% (19422/32918)
Updating files:  60% (19751/32918)
Updating files:  61% (20080/32918)
Updating files:  62% (20410/32918)
Updating files:  63% (20739/32918)
Updating files:  64% (21068/32918)
Updating files:  65% (21397/32918)
Updating files:  66% (21726/32918)
Updating files:  67% (22056/32918)
Updating files:  68% (22385/32918)
Updating files:  69% (22714/32918)
Updating files:  70% (23043/32918)
Updating files:  71% (23372/32918)
Updating files:  72% (23701/32918)
Updating files:  73% (24031/32918)
Updating files:  74% (24360/32918)
Updating files:  75% (24689/32918)
Updating files:  76% (25018/32918)
Updating files:  77% (25347/32918)
Updating files:  78% (25677/32918)
Updating files:  79% (26006/32918)
Updating files:  80% (26335/32918)
Updating files:  81% (26664/32918)
Updating files:  82% (26993/32918)
Updating files:  83% (27322/32918)
Updating files:  84% (27652/32918)
Updating files:  85% (27981/32918)
Updating files:  86% (28310/32918)
Updating files:  87% (28639/32918)
Updating files:  88% (28968/32918)
Updating files:  89% (29298/32918)
Updating files:  90% (29627/32918)
Updating files:  91% (29956/32918)
Updating files:  92% (30285/32918)
Updating files:  93% (30614/32918)
Updating files:  94% (30943/32918)
Updating files:  95% (31273/32918)
Updating files:  96% (31602/32918)
Updating files:  97% (31931/32918)
Updating files:  98% (32260/32918)
Updating files:  99% (32589/32918)
Updating files: 100% (32918/32918)
Updating files: 100% (32918/32918), done.
HEAD is now at 8477e9a74b Merge pull request #25221 from nberth/mlgmpidl-1.3.0
Updating 8477e9a74b..8c7391d6ec
Fast-forward
 packages/conf-pkg-config/conf-pkg-config.1.0/opam | 2 +-
 packages/conf-pkg-config/conf-pkg-config.1.1/opam | 1 +
 packages/conf-pkg-config/conf-pkg-config.1.2/opam | 1 +
 packages/conf-pkg-config/conf-pkg-config.1.3/opam | 1 +
 packages/conf-pkg-config/conf-pkg-config.2/opam   | 1 +
 packages/conf-pkg-config/conf-pkg-config.3/opam   | 4 +++-
 6 files changed, 8 insertions(+), 2 deletions(-)

(from ocaml/opam:debian-12-ocaml-5.1@sha256:931805f2c2fdb0b5642ae8463ff0780c2ee3f4afb48734a7d94e2d5163429930)
2024-02-12 20:07.11 ---> using "4df7ce52b8e0afe130cbfff7d9b001e43cae58bd8e8710cd073ce7c11b1c6ac8" from cache

/: (user (uid 1000) (gid 1000))

/: (workdir /home/opam)

/home/opam: (run (shell "sudo ln -f /usr/bin/opam-dev /usr/bin/opam"))
2024-02-12 20:07.11 ---> using "2ee14a5dbb7aa54ab1dfa5adba4422c5a5483941525d4174e8eeed0c4c5e97aa" from cache

/home/opam: (run (network host)
                 (shell "opam init --reinit --config .opamrc-sandbox -ni"))
This development version of opam requires an update to the layout of /home/opam/.opam from version 2.0 to version 2.2~alpha, which can't be reverted.
You may want to back it up before going further.

Configuring from /home/opam/.opamrc-sandbox, then /home/opam/.opamrc, and finally from built-in defaults.
Checking for available remotes: rsync and local, git.
  - you won't be able to use mercurial repositories unless you install the hg command on your system.
  - you won't be able to use darcs repositories unless you install the darcs command on your system.

Continue? [y/n] y
Format upgrade done.
[NOTE] The 'jobs' option was reset, its value was 71 and its new value will vary according to the current number of cores on your machine. You can restore the fixed value using:
           opam option jobs=71 --global

<><> Updating repositories ><><><><><><><><><><><><><><><><><><><><><><><><><><>
[default] synchronised from file:///home/opam/opam-repository
2024-02-12 20:07.11 ---> using "d58131e4d084860f74dbebecfc9a35ebb7fbb42cf58093b5ac6cf0adf11ed898" from cache

/home/opam: (env OPAMDOWNLOADJOBS 1)

/home/opam: (env OPAMERRLOGLEN 0)

/home/opam: (env OPAMSOLVERTIMEOUT 500)

/home/opam: (env OPAMPRECISETRACKING 1)

/home/opam: (env CI true)

/home/opam: (env OPAM_REPO_CI true)

/home/opam: (run (shell "rm -rf opam-repository/"))
2024-02-12 20:07.11 ---> using "e76676ee91f5598b65d18de047738848e5af056a75e3436903dc82ff5702c5a6" from cache

/home/opam: (copy (src .) (dst opam-repository/))
2024-02-12 20:07.13 ---> using "00dcf922e87fec2f8ccdd0b44355d41faed143c596db4bfe8812d0e9c5f33f02" from cache

/home/opam: (run (shell "opam repository set-url --strict default opam-repository/"))
[default] Initialised
2024-02-12 20:07.13 ---> using "d6c8604b98b9d01914259989eafdfad7780b6c9f761a469dfe3162a56ba73510" from cache

/home/opam: (run (network host)
                 (shell "opam update --depexts || true"))
+ /usr/bin/sudo "apt-get" "update"
- Get:1 http://deb.debian.org/debian bookworm InRelease [151 kB]
- Get:2 http://deb.debian.org/debian bookworm-updates InRelease [52.1 kB]
- Get:3 http://deb.debian.org/debian-security bookworm-security InRelease [48.0 kB]
- Get:4 http://deb.debian.org/debian bookworm/main amd64 Packages [8786 kB]
- Get:5 http://deb.debian.org/debian-security bookworm-security/main amd64 Packages [137 kB]
- Fetched 9175 kB in 1s (6720 kB/s)
- Reading package lists...
2024-02-12 20:07.13 ---> using "6245d7929b862e6b37f451133c05d21883283d0248743f67197f2e424fe52d69" from cache

/home/opam: (env OPAMCRITERIA -removed,-count[avoid-version,changed],-count[version-lag,request],-count[version-lag,changed],-count[missing-depexts,changed],-changed)

/home/opam: (env OPAMFIXUPCRITERIA -removed,-count[avoid-version,changed],-count[version-lag,request],-count[version-lag,changed],-count[missing-depexts,changed],-changed)

/home/opam: (env OPAMUPGRADECRITERIA -removed,-count[avoid-version,changed],-count[version-lag,request],-count[version-lag,changed],-count[missing-depexts,changed],-changed)

/home/opam: (run (shell "opam pin add -k version -yn conf-pkg-config.1.1 1.1"))
conf-pkg-config is now pinned to version 1.1
2024-02-12 20:07.13 ---> using "efd69474de39398f08b803f28b1c0635d272139b0c33f4b0a322013c52989663" from cache

/home/opam: (run (cache (opam-archives (target /home/opam/.opam/download-cache)))
                 (network host)
                 (shell  "opam reinstall conf-pkg-config.1.1;\
                        \n        res=$?;\
                        \n        test \"$res\" != 31 && exit \"$res\";\
                        \n        export OPAMCLI=2.0;\
                        \n        build_dir=$(opam var prefix)/.opam-switch/build;\
                        \n        failed=$(ls \"$build_dir\");\
                        \n        partial_fails=\"\";\
                        \n        for pkg in $failed; do\
                        \n          if opam show -f x-ci-accept-failures: \"$pkg\" | grep -qF \"\\\"debian-12\\\"\"; then\
                        \n            echo \"A package failed and has been disabled for CI using the 'x-ci-accept-failures' field.\";\
                        \n          fi;\
                        \n          test \"$pkg\" != 'conf-pkg-config.1.1' && partial_fails=\"$partial_fails $pkg\";\
                        \n        done;\
                        \n        test \"${partial_fails}\" != \"\" && echo \"opam-repo-ci detected dependencies failing: ${partial_fails}\";\
                        \n        exit 1"))
conf-pkg-config.1.1 is not installed. Install it? [y/n] y
The following actions will be performed:
=== install 1 package
  - install conf-pkg-config 1.1 (pinned)

The following system packages will first need to be installed:
    pkg-config

<><> Handling external dependencies <><><><><><><><><><><><><><><><><><><><><><>

opam believes some required external dependencies are missing. opam can:
> 1. Run apt-get to install them (may need root/sudo access)
  2. Display the recommended apt-get command and wait while you run it manually (e.g. in another terminal)
  3. Continue anyway, and, upon success, permanently register that this external dependency is present, but not detectable
  4. Abort the installation

[1/2/3/4] 1

+ /usr/bin/sudo "apt-get" "install" "-qq" "-yy" "pkg-config"
- debconf: delaying package configuration, since apt-utils is not installed
- Selecting previously unselected package libpkgconf3:amd64.
- (Reading database ... 
(Reading database ... 5%
(Reading database ... 10%
(Reading database ... 15%
(Reading database ... 20%
(Reading database ... 25%
(Reading database ... 30%
(Reading database ... 35%
(Reading database ... 40%
(Reading database ... 45%
(Reading database ... 50%
(Reading database ... 55%
(Reading database ... 60%
(Reading database ... 65%
(Reading database ... 70%
(Reading database ... 75%
(Reading database ... 80%
(Reading database ... 85%
(Reading database ... 90%
(Reading database ... 95%
(Reading database ... 100%
(Reading database ... 18774 files and directories currently installed.)
- Preparing to unpack .../libpkgconf3_1.8.1-1_amd64.deb ...
- Unpacking libpkgconf3:amd64 (1.8.1-1) ...
- Selecting previously unselected package pkgconf-bin.
- Preparing to unpack .../pkgconf-bin_1.8.1-1_amd64.deb ...
- Unpacking pkgconf-bin (1.8.1-1) ...
- Selecting previously unselected package pkgconf:amd64.
- Preparing to unpack .../pkgconf_1.8.1-1_amd64.deb ...
- Unpacking pkgconf:amd64 (1.8.1-1) ...
- Selecting previously unselected package pkg-config:amd64.
- Preparing to unpack .../pkg-config_1.8.1-1_amd64.deb ...
- Unpacking pkg-config:amd64 (1.8.1-1) ...
- Setting up libpkgconf3:amd64 (1.8.1-1) ...
- Setting up pkgconf-bin (1.8.1-1) ...
- Setting up pkgconf:amd64 (1.8.1-1) ...
- Setting up pkg-config:amd64 (1.8.1-1) ...
- Processing triggers for libc-bin (2.36-9+deb12u4) ...

<><> Processing actions <><><><><><><><><><><><><><><><><><><><><><><><><><><><>
-> installed conf-pkg-config.1.1
Done.
# Run eval $(opam env) to update the current shell environment
2024-02-12 20:07.13 ---> using "0686843ae3c31f38ac5563a3bcd57d9eed648c8dbf66daffdc86057dfb09ccb3" from cache

/home/opam: (env OPAMCRITERIA -removed,-count[avoid-version,changed],-count[version-lag,request],-count[version-lag,changed],-count[missing-depexts,changed],-changed)

/home/opam: (env OPAMFIXUPCRITERIA -removed,-count[avoid-version,changed],-count[version-lag,request],-count[version-lag,changed],-count[missing-depexts,changed],-changed)

/home/opam: (env OPAMUPGRADECRITERIA -removed,-count[avoid-version,changed],-count[version-lag,request],-count[version-lag,changed],-count[missing-depexts,changed],-changed)

/home/opam: (run (cache (opam-archives (target /home/opam/.opam/download-cache)))
                 (network host)
                 (shell  "opam reinstall solo5-bindings-hvt.0.6.6;\
                        \n        res=$?;\
                        \n        test \"$res\" != 31 && exit \"$res\";\
                        \n        export OPAMCLI=2.0;\
                        \n        build_dir=$(opam var prefix)/.opam-switch/build;\
                        \n        failed=$(ls \"$build_dir\");\
                        \n        partial_fails=\"\";\
                        \n        for pkg in $failed; do\
                        \n          if opam show -f x-ci-accept-failures: \"$pkg\" | grep -qF \"\\\"debian-12\\\"\"; then\
                        \n            echo \"A package failed and has been disabled for CI using the 'x-ci-accept-failures' field.\";\
                        \n          fi;\
                        \n          test \"$pkg\" != 'solo5-bindings-hvt.0.6.6' && partial_fails=\"$partial_fails $pkg\";\
                        \n        done;\
                        \n        test \"${partial_fails}\" != \"\" && echo \"opam-repo-ci detected dependencies failing: ${partial_fails}\";\
                        \n        exit 1"))
solo5-bindings-hvt.0.6.6 is not installed. Install it? [y/n] y
The following actions will be performed:
=== install 2 packages
  - install conf-libseccomp    1     [required by solo5-bindings-hvt]
  - install solo5-bindings-hvt 0.6.6

The following system packages will first need to be installed:
    libseccomp-dev

<><> Handling external dependencies <><><><><><><><><><><><><><><><><><><><><><>

opam believes some required external dependencies are missing. opam can:
> 1. Run apt-get to install them (may need root/sudo access)
  2. Display the recommended apt-get command and wait while you run it manually (e.g. in another terminal)
  3. Continue anyway, and, upon success, permanently register that this external dependency is present, but not detectable
  4. Abort the installation

[1/2/3/4] 1

+ /usr/bin/sudo "apt-get" "install" "-qq" "-yy" "libseccomp-dev"
- debconf: delaying package configuration, since apt-utils is not installed
- Selecting previously unselected package libseccomp-dev:amd64.
- (Reading database ... 
(Reading database ... 5%
(Reading database ... 10%
(Reading database ... 15%
(Reading database ... 20%
(Reading database ... 25%
(Reading database ... 30%
(Reading database ... 35%
(Reading database ... 40%
(Reading database ... 45%
(Reading database ... 50%
(Reading database ... 55%
(Reading database ... 60%
(Reading database ... 65%
(Reading database ... 70%
(Reading database ... 75%
(Reading database ... 80%
(Reading database ... 85%
(Reading database ... 90%
(Reading database ... 95%
(Reading database ... 100%
(Reading database ... 18810 files and directories currently installed.)
- Preparing to unpack .../libseccomp-dev_2.5.4-1+b3_amd64.deb ...
- Unpacking libseccomp-dev:amd64 (2.5.4-1+b3) ...
- Setting up libseccomp-dev:amd64 (2.5.4-1+b3) ...

<><> Processing actions <><><><><><><><><><><><><><><><><><><><><><><><><><><><>
-> retrieved solo5-bindings-hvt.0.6.6  (cached)
-> installed conf-libseccomp.1
[ERROR] The compilation of solo5-bindings-hvt.0.6.6 failed at "make V=1 CONFIG_SPT= CONFIG_VIRTIO= CONFIG_MUEN= CONFIG_GENODE= CONFIG_XEN=".

#=== ERROR while compiling solo5-bindings-hvt.0.6.6 ===========================#
# context              2.2.0~beta2~dev | linux/x86_64 | ocaml-base-compiler.5.1.1 | file:///home/opam/opam-repository
# path                 ~/.opam/5.1/.opam-switch/build/solo5-bindings-hvt.0.6.6
# command              ~/.opam/opam-init/hooks/sandbox.sh build make V=1 CONFIG_SPT= CONFIG_VIRTIO= CONFIG_MUEN= CONFIG_GENODE= CONFIG_XEN=
# exit-code            2
# env-file             ~/.opam/log/solo5-bindings-hvt-7-853cab.env
# output-file          ~/.opam/log/solo5-bindings-hvt-7-853cab.out
### output ###
# GEN include/solo5/solo5_version.h
# scripts/gen_version_h.sh include/solo5/solo5_version.h
# MAKE bindings
# make -C bindings  
# make[1]: Entering directory '/home/opam/.opam/5.1/.opam-switch/build/solo5-bindings-hvt.0.6.6/bindings'
# CC hvt/start.c
# cc -MT hvt/start.o -MMD -MP -MF hvt/start.Td -std=c11 -Wall -Wextra -Werror -O2 -g -ffreestanding -fstack-protector-strong -nostdinc -mstack-protector-guard=global -mno-sse -mno-mmx -mno-aes -mno-avx -mno-red-zone -isystem /home/opam/.opam/5.1/.opam-switch/build/solo5-bindings-hvt.0.6.6/include/crt -I/home/opam/.opam/5.1/.opam-switch/build/solo5-bindings-hvt.0.6.6/include/solo5 -D__SOLO5_BINDINGS__ -c hvt/start.c -o hvt/start.o
# mv -f hvt/start.Td hvt/start.d && touch hvt/start.o
# CC abort.c
# cc -MT abort.o -MMD -MP -MF abort.Td -std=c11 -Wall -Wextra -Werror -O2 -g -ffreestanding -fstack-protector-strong -nostdinc -mstack-protector-guard=global -mno-sse -mno-mmx -mno-aes -mno-avx -mno-red-zone -isystem /home/opam/.opam/5.1/.opam-switch/build/solo5-bindings-hvt.0.6.6/include/crt -I/home/opam/.opam/5.1/.opam-switch/build/solo5-bindings-hvt.0.6.6/include/solo5 -D__SOLO5_BINDINGS__ -c abort.c -o abort.o
# mv -f abort.Td abort.d && touch abort.o
# CC cpu_x86_64.c
# cc -MT cpu_x86_64.o -MMD -MP -MF cpu_x86_64.Td -std=c11 -Wall -Wextra -Werror -O2 -g -ffreestanding -fstack-protector-strong -nostdinc -mstack-protector-guard=global -mno-sse -mno-mmx -mno-aes -mno-avx -mno-red-zone -isystem /home/opam/.opam/5.1/.opam-switch/build/solo5-bindings-hvt.0.6.6/include/crt -I/home/opam/.opam/5.1/.opam-switch/build/solo5-bindings-hvt.0.6.6/include/solo5 -D__SOLO5_BINDINGS__ -c cpu_x86_64.c -o cpu_x86_64.o
# mv -f cpu_x86_64.Td cpu_x86_64.d && touch cpu_x86_64.o
# AS cpu_vectors_x86_64.S
# cc -MT cpu_vectors_x86_64.o -MMD -MP -MF cpu_vectors_x86_64.Td -std=c11 -Wall -Wextra -Werror -O2 -g -ffreestanding -fstack-protector-strong -nostdinc -mstack-protector-guard=global -mno-sse -mno-mmx -mno-aes -mno-avx -mno-red-zone -isystem /home/opam/.opam/5.1/.opam-switch/build/solo5-bindings-hvt.0.6.6/include/crt -I/home/opam/.opam/5.1/.opam-switch/build/solo5-bindings-hvt.0.6.6/include/solo5 -D__SOLO5_BINDINGS__ -DASM_FILE -c cpu_vectors_x86_64.S -o cpu_vectors_x86_64.o
# mv -f cpu_vectors_x86_64.Td cpu_vectors_x86_64.d && touch cpu_vectors_x86_64.o
# CC crt.c
# cc -MT crt.o -MMD -MP -MF crt.Td -std=c11 -Wall -Wextra -Werror -O2 -g -ffreestanding -fstack-protector-strong -nostdinc -mstack-protector-guard=global -mno-sse -mno-mmx -mno-aes -mno-avx -mno-red-zone -isystem /home/opam/.opam/5.1/.opam-switch/build/solo5-bindings-hvt.0.6.6/include/crt -I/home/opam/.opam/5.1/.opam-switch/build/solo5-bindings-hvt.0.6.6/include/solo5 -D__SOLO5_BINDINGS__ -c crt.c -o crt.o
# mv -f crt.Td crt.d && touch crt.o
# CC printf.c
# cc -MT printf.o -MMD -MP -MF printf.Td -std=c11 -Wall -Wextra -Werror -O2 -g -ffreestanding -fstack-protector-strong -nostdinc -mstack-protector-guard=global -mno-sse -mno-mmx -mno-aes -mno-avx -mno-red-zone -isystem /home/opam/.opam/5.1/.opam-switch/build/solo5-bindings-hvt.0.6.6/include/crt -I/home/opam/.opam/5.1/.opam-switch/build/solo5-bindings-hvt.0.6.6/include/solo5 -D__SOLO5_BINDINGS__ -c printf.c -o printf.o
# mv -f printf.Td printf.d && touch printf.o
# CC intr.c
# cc -MT intr.o -MMD -MP -MF intr.Td -std=c11 -Wall -Wextra -Werror -O2 -g -ffreestanding -fstack-protector-strong -nostdinc -mstack-protector-guard=global -mno-sse -mno-mmx -mno-aes -mno-avx -mno-red-zone -isystem /home/opam/.opam/5.1/.opam-switch/build/solo5-bindings-hvt.0.6.6/include/crt -I/home/opam/.opam/5.1/.opam-switch/build/solo5-bindings-hvt.0.6.6/include/solo5 -D__SOLO5_BINDINGS__ -c intr.c -o intr.o
# mv -f intr.Td intr.d && touch intr.o
# CC lib.c
# cc -MT lib.o -MMD -MP -MF lib.Td -std=c11 -Wall -Wextra -Werror -O2 -g -ffreestanding -fstack-protector-strong -nostdinc -mstack-protector-guard=global -mno-sse -mno-mmx -mno-aes -mno-avx -mno-red-zone -isystem /home/opam/.opam/5.1/.opam-switch/build/solo5-bindings-hvt.0.6.6/include/crt -I/home/opam/.opam/5.1/.opam-switch/build/solo5-bindings-hvt.0.6.6/include/solo5 -D__SOLO5_BINDINGS__ -c lib.c -o lib.o
# mv -f lib.Td lib.d && touch lib.o
# CC mem.c
# cc -MT mem.o -MMD -MP -MF mem.Td -std=c11 -Wall -Wextra -Werror -O2 -g -ffreestanding -fstack-protector-strong -nostdinc -mstack-protector-guard=global -mno-sse -mno-mmx -mno-aes -mno-avx -mno-red-zone -isystem /home/opam/.opam/5.1/.opam-switch/build/solo5-bindings-hvt.0.6.6/include/crt -I/home/opam/.opam/5.1/.opam-switch/build/solo5-bindings-hvt.0.6.6/include/solo5 -D__SOLO5_BINDINGS__ -c mem.c -o mem.o
# mv -f mem.Td mem.d && touch mem.o
# CC exit.c
# cc -MT exit.o -MMD -MP -MF exit.Td -std=c11 -Wall -Wextra -Werror -O2 -g -ffreestanding -fstack-protector-strong -nostdinc -mstack-protector-guard=global -mno-sse -mno-mmx -mno-aes -mno-avx -mno-red-zone -isystem /home/opam/.opam/5.1/.opam-switch/build/solo5-bindings-hvt.0.6.6/include/crt -I/home/opam/.opam/5.1/.opam-switch/build/solo5-bindings-hvt.0.6.6/include/solo5 -D__SOLO5_BINDINGS__ -c exit.c -o exit.o
# mv -f exit.Td exit.d && touch exit.o
# CC log.c
# cc -MT log.o -MMD -MP -MF log.Td -std=c11 -Wall -Wextra -Werror -O2 -g -ffreestanding -fstack-protector-strong -nostdinc -mstack-protector-guard=global -mno-sse -mno-mmx -mno-aes -mno-avx -mno-red-zone -isystem /home/opam/.opam/5.1/.opam-switch/build/solo5-bindings-hvt.0.6.6/include/crt -I/home/opam/.opam/5.1/.opam-switch/build/solo5-bindings-hvt.0.6.6/include/solo5 -D__SOLO5_BINDINGS__ -c log.c -o log.o
# mv -f log.Td log.d && touch log.o
# CC cmdline.c
# cc -MT cmdline.o -MMD -MP -MF cmdline.Td -std=c11 -Wall -Wextra -Werror -O2 -g -ffreestanding -fstack-protector-strong -nostdinc -mstack-protector-guard=global -mno-sse -mno-mmx -mno-aes -mno-avx -mno-red-zone -isystem /home/opam/.opam/5.1/.opam-switch/build/solo5-bindings-hvt.0.6.6/include/crt -I/home/opam/.opam/5.1/.opam-switch/build/solo5-bindings-hvt.0.6.6/include/solo5 -D__SOLO5_BINDINGS__ -c cmdline.c -o cmdline.o
# mv -f cmdline.Td cmdline.d && touch cmdline.o
# CC tls.c
# cc -MT tls.o -MMD -MP -MF tls.Td -std=c11 -Wall -Wextra -Werror -O2 -g -ffreestanding -fstack-protector-strong -nostdinc -mstack-protector-guard=global -mno-sse -mno-mmx -mno-aes -mno-avx -mno-red-zone -isystem /home/opam/.opam/5.1/.opam-switch/build/solo5-bindings-hvt.0.6.6/include/crt -I/home/opam/.opam/5.1/.opam-switch/build/solo5-bindings-hvt.0.6.6/include/solo5 -D__SOLO5_BINDINGS__ -c tls.c -o tls.o
# mv -f tls.Td tls.d && touch tls.o
# CC mft.c
# cc -MT mft.o -MMD -MP -MF mft.Td -std=c11 -Wall -Wextra -Werror -O2 -g -ffreestanding -fstack-protector-strong -nostdinc -mstack-protector-guard=global -mno-sse -mno-mmx -mno-aes -mno-avx -mno-red-zone -isystem /home/opam/.opam/5.1/.opam-switch/build/solo5-bindings-hvt.0.6.6/include/crt -I/home/opam/.opam/5.1/.opam-switch/build/solo5-bindings-hvt.0.6.6/include/solo5 -D__SOLO5_BINDINGS__ -c mft.c -o mft.o
# mv -f mft.Td mft.d && touch mft.o
# CC hvt/platform.c
# cc -MT hvt/platform.o -MMD -MP -MF hvt/platform.Td -std=c11 -Wall -Wextra -Werror -O2 -g -ffreestanding -fstack-protector-strong -nostdinc -mstack-protector-guard=global -mno-sse -mno-mmx -mno-aes -mno-avx -mno-red-zone -isystem /home/opam/.opam/5.1/.opam-switch/build/solo5-bindings-hvt.0.6.6/include/crt -I/home/opam/.opam/5.1/.opam-switch/build/solo5-bindings-hvt.0.6.6/include/solo5 -D__SOLO5_BINDINGS__ -c hvt/platform.c -o hvt/platform.o
# mv -f hvt/platform.Td hvt/platform.d && touch hvt/platform.o
# CC hvt/platform_intr.c
# cc -MT hvt/platform_intr.o -MMD -MP -MF hvt/platform_intr.Td -std=c11 -Wall -Wextra -Werror -O2 -g -ffreestanding -fstack-protector-strong -nostdinc -mstack-protector-guard=global -mno-sse -mno-mmx -mno-aes -mno-avx -mno-red-zone -isystem /home/opam/.opam/5.1/.opam-switch/build/solo5-bindings-hvt.0.6.6/include/crt -I/home/opam/.opam/5.1/.opam-switch/build/solo5-bindings-hvt.0.6.6/include/solo5 -D__SOLO5_BINDINGS__ -c hvt/platform_intr.c -o hvt/platform_intr.o
# mv -f hvt/platform_intr.Td hvt/platform_intr.d && touch hvt/platform_intr.o
# CC hvt/time.c
# cc -MT hvt/time.o -MMD -MP -MF hvt/time.Td -std=c11 -Wall -Wextra -Werror -O2 -g -ffreestanding -fstack-protector-strong -nostdinc -mstack-protector-guard=global -mno-sse -mno-mmx -mno-aes -mno-avx -mno-red-zone -isystem /home/opam/.opam/5.1/.opam-switch/build/solo5-bindings-hvt.0.6.6/include/crt -I/home/opam/.opam/5.1/.opam-switch/build/solo5-bindings-hvt.0.6.6/include/solo5 -D__SOLO5_BINDINGS__ -c hvt/time.c -o hvt/time.o
# mv -f hvt/time.Td hvt/time.d && touch hvt/time.o
# CC hvt/platform_lifecycle.c
# cc -MT hvt/platform_lifecycle.o -MMD -MP -MF hvt/platform_lifecycle.Td -std=c11 -Wall -Wextra -Werror -O2 -g -ffreestanding -fstack-protector-strong -nostdinc -mstack-protector-guard=global -mno-sse -mno-mmx -mno-aes -mno-avx -mno-red-zone -isystem /home/opam/.opam/5.1/.opam-switch/build/solo5-bindings-hvt.0.6.6/include/crt -I/home/opam/.opam/5.1/.opam-switch/build/solo5-bindings-hvt.0.6.6/include/solo5 -D__SOLO5_BINDINGS__ -c hvt/platform_lifecycle.c -o hvt/platform_lifecycle.o
# mv -f hvt/platform_lifecycle.Td hvt/platform_lifecycle.d && touch hvt/platform_lifecycle.o
# CC hvt/yield.c
# cc -MT hvt/yield.o -MMD -MP -MF hvt/yield.Td -std=c11 -Wall -Wextra -Werror -O2 -g -ffreestanding -fstack-protector-strong -nostdinc -mstack-protector-guard=global -mno-sse -mno-mmx -mno-aes -mno-avx -mno-red-zone -isystem /home/opam/.opam/5.1/.opam-switch/build/solo5-bindings-hvt.0.6.6/include/crt -I/home/opam/.opam/5.1/.opam-switch/build/solo5-bindings-hvt.0.6.6/include/solo5 -D__SOLO5_BINDINGS__ -c hvt/yield.c -o hvt/yield.o
# mv -f hvt/yield.Td hvt/yield.d && touch hvt/yield.o
# CC hvt/tscclock.c
# cc -MT hvt/tscclock.o -MMD -MP -MF hvt/tscclock.Td -std=c11 -Wall -Wextra -Werror -O2 -g -ffreestanding -fstack-protector-strong -nostdinc -mstack-protector-guard=global -mno-sse -mno-mmx -mno-aes -mno-avx -mno-red-zone -isystem /home/opam/.opam/5.1/.opam-switch/build/solo5-bindings-hvt.0.6.6/include/crt -I/home/opam/.opam/5.1/.opam-switch/build/solo5-bindings-hvt.0.6.6/include/solo5 -D__SOLO5_BINDINGS__ -c hvt/tscclock.c -o hvt/tscclock.o
# mv -f hvt/tscclock.Td hvt/tscclock.d && touch hvt/tscclock.o
# CC hvt/console.c
# cc -MT hvt/console.o -MMD -MP -MF hvt/console.Td -std=c11 -Wall -Wextra -Werror -O2 -g -ffreestanding -fstack-protector-strong -nostdinc -mstack-protector-guard=global -mno-sse -mno-mmx -mno-aes -mno-avx -mno-red-zone -isystem /home/opam/.opam/5.1/.opam-switch/build/solo5-bindings-hvt.0.6.6/include/crt -I/home/opam/.opam/5.1/.opam-switch/build/solo5-bindings-hvt.0.6.6/include/solo5 -D__SOLO5_BINDINGS__ -c hvt/console.c -o hvt/console.o
# mv -f hvt/console.Td hvt/console.d && touch hvt/console.o
# CC hvt/net.c
# cc -MT hvt/net.o -MMD -MP -MF hvt/net.Td -std=c11 -Wall -Wextra -Werror -O2 -g -ffreestanding -fstack-protector-strong -nostdinc -mstack-protector-guard=global -mno-sse -mno-mmx -mno-aes -mno-avx -mno-red-zone -isystem /home/opam/.opam/5.1/.opam-switch/build/solo5-bindings-hvt.0.6.6/include/crt -I/home/opam/.opam/5.1/.opam-switch/build/solo5-bindings-hvt.0.6.6/include/solo5 -D__SOLO5_BINDINGS__ -c hvt/net.c -o hvt/net.o
# mv -f hvt/net.Td hvt/net.d && touch hvt/net.o
# CC hvt/block.c
# cc -MT hvt/block.o -MMD -MP -MF hvt/block.Td -std=c11 -Wall -Wextra -Werror -O2 -g -ffreestanding -fstack-protector-strong -nostdinc -mstack-protector-guard=global -mno-sse -mno-mmx -mno-aes -mno-avx -mno-red-zone -isystem /home/opam/.opam/5.1/.opam-switch/build/solo5-bindings-hvt.0.6.6/include/crt -I/home/opam/.opam/5.1/.opam-switch/build/solo5-bindings-hvt.0.6.6/include/solo5 -D__SOLO5_BINDINGS__ -c hvt/block.c -o hvt/block.o
# mv -f hvt/block.Td hvt/block.d && touch hvt/block.o
# LD hvt/solo5_hvt.o
# ld -r -nostdlib -z max-page-size=0x1000 -static  hvt/start.o abort.o cpu_x86_64.o cpu_vectors_x86_64.o crt.o printf.o intr.o lib.o mem.o exit.o log.o cmdline.o tls.o mft.o hvt/platform.o hvt/platform_intr.o hvt/time.o hvt/platform_lifecycle.o hvt/yield.o hvt/tscclock.o hvt/console.o hvt/net.o hvt/block.o -o hvt/solo5_hvt.o
# ld: warning: cpu_vectors_x86_64.o: missing .note.GNU-stack section implies executable stack
# ld: NOTE: This behaviour is deprecated and will be removed in a future version of the linker
# OBJCOPY hvt/solo5_hvt.o
# objcopy -w -G solo5_\* -G _start\* -G __stack_chk_guard -G __stack_chk_fail hvt/solo5_hvt.o hvt/solo5_hvt.o
# make[1]: Leaving directory '/home/opam/.opam/5.1/.opam-switch/build/solo5-bindings-hvt.0.6.6/bindings'
# MAKE tenders
# make -C tenders  
# make[1]: Entering directory '/home/opam/.opam/5.1/.opam-switch/build/solo5-bindings-hvt.0.6.6/tenders'
# HOSTCC common/elf.c
# cc -MT common/elf.o -MMD -MP -MF common/elf.Td -Wall -Werror -std=c11 -fstack-protector-strong -O2 -g -I/home/opam/.opam/5.1/.opam-switch/build/solo5-bindings-hvt.0.6.6/include/solo5 -c common/elf.c -o common/elf.o
# mv -f common/elf.Td common/elf.d && touch common/elf.o
# HOSTCC common/mft.c
# cc -MT common/mft.o -MMD -MP -MF common/mft.Td -Wall -Werror -std=c11 -fstack-protector-strong -O2 -g -I/home/opam/.opam/5.1/.opam-switch/build/solo5-bindings-hvt.0.6.6/include/solo5 -c common/mft.c -o common/mft.o
# mv -f common/mft.Td common/mft.d && touch common/mft.o
# HOSTCC common/block_attach.c
# cc -MT common/block_attach.o -MMD -MP -MF common/block_attach.Td -Wall -Werror -std=c11 -fstack-protector-strong -O2 -g -I/home/opam/.opam/5.1/.opam-switch/build/solo5-bindings-hvt.0.6.6/include/solo5 -c common/block_attach.c -o common/block_attach.o
# mv -f common/block_attach.Td common/block_attach.d && touch common/block_attach.o
# HOSTCC common/tap_attach.c
# cc -MT common/tap_attach.o -MMD -MP -MF common/tap_attach.Td -Wall -Werror -std=c11 -fstack-protector-strong -O2 -g -I/home/opam/.opam/5.1/.opam-switch/build/solo5-bindings-hvt.0.6.6/include/solo5 -c common/tap_attach.c -o common/tap_attach.o
# mv -f common/tap_attach.Td common/tap_attach.d && touch common/tap_attach.o
# HOSTAR common/libcommon.a
# ar rc common/libcommon.a common/elf.o common/mft.o common/block_attach.o common/tap_attach.o
# HOSTCC hvt/hvt_boot_info.c
# cc -MT hvt/hvt_boot_info.o -MMD -MP -MF hvt/hvt_boot_info.Td -Wall -Werror -std=c11 -fstack-protector-strong -O2 -g -I/home/opam/.opam/5.1/.opam-switch/build/solo5-bindings-hvt.0.6.6/include/solo5 -c hvt/hvt_boot_info.c -o hvt/hvt_boot_info.o
# mv -f hvt/hvt_boot_info.Td hvt/hvt_boot_info.d && touch hvt/hvt_boot_info.o
# HOSTCC hvt/hvt_core.c
# cc -MT hvt/hvt_core.o -MMD -MP -MF hvt/hvt_core.Td -Wall -Werror -std=c11 -fstack-protector-strong -O2 -g -I/home/opam/.opam/5.1/.opam-switch/build/solo5-bindings-hvt.0.6.6/include/solo5 -c hvt/hvt_core.c -o hvt/hvt_core.o
# mv -f hvt/hvt_core.Td hvt/hvt_core.d && touch hvt/hvt_core.o
# HOSTCC hvt/hvt_main.c
# cc -MT hvt/hvt_main.o -MMD -MP -MF hvt/hvt_main.Td -Wall -Werror -std=c11 -fstack-protector-strong -O2 -g -I/home/opam/.opam/5.1/.opam-switch/build/solo5-bindings-hvt.0.6.6/include/solo5 -c hvt/hvt_main.c -o hvt/hvt_main.o
# mv -f hvt/hvt_main.Td hvt/hvt_main.d && touch hvt/hvt_main.o
# HOSTCC hvt/hvt_cpu_x86_64.c
# cc -MT hvt/hvt_cpu_x86_64.o -MMD -MP -MF hvt/hvt_cpu_x86_64.Td -Wall -Werror -std=c11 -fstack-protector-strong -O2 -g -I/home/opam/.opam/5.1/.opam-switch/build/solo5-bindings-hvt.0.6.6/include/solo5 -c hvt/hvt_cpu_x86_64.c -o hvt/hvt_cpu_x86_64.o
# mv -f hvt/hvt_cpu_x86_64.Td hvt/hvt_cpu_x86_64.d && touch hvt/hvt_cpu_x86_64.o
# HOSTCC hvt/hvt_kvm.c
# cc -MT hvt/hvt_kvm.o -MMD -MP -MF hvt/hvt_kvm.Td -Wall -Werror -std=c11 -fstack-protector-strong -O2 -g -I/home/opam/.opam/5.1/.opam-switch/build/solo5-bindings-hvt.0.6.6/include/solo5 -c hvt/hvt_kvm.c -o hvt/hvt_kvm.o
# mv -f hvt/hvt_kvm.Td hvt/hvt_kvm.d && touch hvt/hvt_kvm.o
# HOSTCC hvt/hvt_kvm_x86_64.c
# cc -MT hvt/hvt_kvm_x86_64.o -MMD -MP -MF hvt/hvt_kvm_x86_64.Td -Wall -Werror -std=c11 -fstack-protector-strong -O2 -g -I/home/opam/.opam/5.1/.opam-switch/build/solo5-bindings-hvt.0.6.6/include/solo5 -c hvt/hvt_kvm_x86_64.c -o hvt/hvt_kvm_x86_64.o
# mv -f hvt/hvt_kvm_x86_64.Td hvt/hvt_kvm_x86_64.d && touch hvt/hvt_kvm_x86_64.o
# HOSTCC hvt/hvt_module_blk.c
# cc -MT hvt/hvt_module_blk.o -MMD -MP -MF hvt/hvt_module_blk.Td -Wall -Werror -std=c11 -fstack-protector-strong -O2 -g -I/home/opam/.opam/5.1/.opam-switch/build/solo5-bindings-hvt.0.6.6/include/solo5 -c hvt/hvt_module_blk.c -o hvt/hvt_module_blk.o
# mv -f hvt/hvt_module_blk.Td hvt/hvt_module_blk.d && touch hvt/hvt_module_blk.o
# HOSTCC hvt/hvt_module_net.c
# cc -MT hvt/hvt_module_net.o -MMD -MP -MF hvt/hvt_module_net.Td -Wall -Werror -std=c11 -fstack-protector-strong -O2 -g -I/home/opam/.opam/5.1/.opam-switch/build/solo5-bindings-hvt.0.6.6/include/solo5 -c hvt/hvt_module_net.c -o hvt/hvt_module_net.o
# mv -f hvt/hvt_module_net.Td hvt/hvt_module_net.d && touch hvt/hvt_module_net.o
# HOSTLINK hvt/solo5-hvt
# cc -Wl,-z -Wl,noexecstack hvt/hvt_boot_info.o hvt/hvt_core.o hvt/hvt_main.o hvt/hvt_cpu_x86_64.o hvt/hvt_kvm.o hvt/hvt_kvm_x86_64.o hvt/hvt_module_blk.o hvt/hvt_module_net.o common/libcommon.a  -o hvt/solo5-hvt
# HOSTCC hvt/hvt_module_gdb.c
# cc -MT hvt/hvt_module_gdb.o -MMD -MP -MF hvt/hvt_module_gdb.Td -Wall -Werror -std=c11 -fstack-protector-strong -O2 -g -I/home/opam/.opam/5.1/.opam-switch/build/solo5-bindings-hvt.0.6.6/include/solo5 -c hvt/hvt_module_gdb.c -o hvt/hvt_module_gdb.o
# mv -f hvt/hvt_module_gdb.Td hvt/hvt_module_gdb.d && touch hvt/hvt_module_gdb.o
# HOSTCC hvt/hvt_module_dumpcore.c
# cc -MT hvt/hvt_module_dumpcore.o -MMD -MP -MF hvt/hvt_module_dumpcore.Td -Wall -Werror -std=c11 -fstack-protector-strong -O2 -g -I/home/opam/.opam/5.1/.opam-switch/build/solo5-bindings-hvt.0.6.6/include/solo5 -c hvt/hvt_module_dumpcore.c -o hvt/hvt_module_dumpcore.o
# mv -f hvt/hvt_module_dumpcore.Td hvt/hvt_module_dumpcore.d && touch hvt/hvt_module_dumpcore.o
# HOSTLINK hvt/solo5-hvt-debug
# cc -Wl,-z -Wl,noexecstack hvt/hvt_boot_info.o hvt/hvt_core.o hvt/hvt_main.o hvt/hvt_cpu_x86_64.o hvt/hvt_kvm.o hvt/hvt_kvm_x86_64.o hvt/hvt_module_blk.o hvt/hvt_module_net.o hvt/hvt_module_gdb.o hvt/hvt_module_dumpcore.o common/libcommon.a  -o hvt/solo5-hvt-debug
# make[1]: Leaving directory '/home/opam/.opam/5.1/.opam-switch/build/solo5-bindings-hvt.0.6.6/tenders'
# MAKE elftool
# make -C elftool  
# make[1]: Entering directory '/home/opam/.opam/5.1/.opam-switch/build/solo5-bindings-hvt.0.6.6/elftool'
# HOSTCC elftool.c
# cc -MT elftool.o -MMD -MP -MF elftool.Td -Wall -Werror -std=c11 -fstack-protector-strong -O2 -g -I/home/opam/.opam/5.1/.opam-switch/build/solo5-bindings-hvt.0.6.6/include/solo5 -c elftool.c -o elftool.o
# mv -f elftool.Td elftool.d && touch elftool.o
# HOSTLINK solo5-elftool
# cc  elftool.o  -o solo5-elftool
# make[1]: Leaving directory '/home/opam/.opam/5.1/.opam-switch/build/solo5-bindings-hvt.0.6.6/elftool'
# MAKE tests
# make -C tests  
# make[1]: Entering directory '/home/opam/.opam/5.1/.opam-switch/build/solo5-bindings-hvt.0.6.6/tests'
# MAKE test_blk
# make -C test_blk  
# make[2]: Entering directory '/home/opam/.opam/5.1/.opam-switch/build/solo5-bindings-hvt.0.6.6/tests/test_blk'
# CC test_blk.c
# cc -std=c11 -Wall -Wextra -Werror -O2 -g -ffreestanding -fstack-protector-strong -nostdinc -mstack-protector-guard=global -isystem /home/opam/.opam/5.1/.opam-switch/build/solo5-bindings-hvt.0.6.6/include/crt -I/home/opam/.opam/5.1/.opam-switch/build/solo5-bindings-hvt.0.6.6/include/solo5 -c test_blk.c -o test_blk.o
# ELFTOOL manifest.json
# /home/opam/.opam/5.1/.opam-switch/build/solo5-bindings-hvt.0.6.6/elftool/solo5-elftool gen-manifest manifest.json manifest.c
# CC manifest.c
# cc -std=c11 -Wall -Wextra -Werror -O2 -g -ffreestanding -fstack-protector-strong -nostdinc -mstack-protector-guard=global -isystem /home/opam/.opam/5.1/.opam-switch/build/solo5-bindings-hvt.0.6.6/include/crt -I/home/opam/.opam/5.1/.opam-switch/build/solo5-bindings-hvt.0.6.6/include/solo5 -c manifest.c -o manifest.o
# LD test_blk.hvt
# ld -nostdlib -z max-page-size=0x1000 -static  -T /home/opam/.opam/5.1/.opam-switch/build/solo5-bindings-hvt.0.6.6/bindings/hvt/solo5_hvt.lds /home/opam/.opam/5.1/.opam-switch/build/solo5-bindings-hvt.0.6.6/bindings/hvt/solo5_hvt.o test_blk.o manifest.o -o test_blk.hvt
# ld: warning: /home/opam/.opam/5.1/.opam-switch/build/solo5-bindings-hvt.0.6.6/bindings/hvt/solo5_hvt.o: requires executable stack (because the .note.GNU-stack section is executable)
# make[2]: Leaving directory '/home/opam/.opam/5.1/.opam-switch/build/solo5-bindings-hvt.0.6.6/tests/test_blk'
# MAKE test_dumpcore
# make -C test_dumpcore  
# make[2]: Entering directory '/home/opam/.opam/5.1/.opam-switch/build/solo5-bindings-hvt.0.6.6/tests/test_dumpcore'
# CC test_dumpcore.c
# cc -std=c11 -Wall -Wextra -Werror -O2 -g -ffreestanding -fstack-protector-strong -nostdinc -mstack-protector-guard=global -isystem /home/opam/.opam/5.1/.opam-switch/build/solo5-bindings-hvt.0.6.6/include/crt -I/home/opam/.opam/5.1/.opam-switch/build/solo5-bindings-hvt.0.6.6/include/solo5 -c test_dumpcore.c -o test_dumpcore.o
# ELFTOOL manifest.json
# /home/opam/.opam/5.1/.opam-switch/build/solo5-bindings-hvt.0.6.6/elftool/solo5-elftool gen-manifest manifest.json manifest.c
# CC manifest.c
# cc -std=c11 -Wall -Wextra -Werror -O2 -g -ffreestanding -fstack-protector-strong -nostdinc -mstack-protector-guard=global -isystem /home/opam/.opam/5.1/.opam-switch/build/solo5-bindings-hvt.0.6.6/include/crt -I/home/opam/.opam/5.1/.opam-switch/build/solo5-bindings-hvt.0.6.6/include/solo5 -c manifest.c -o manifest.o
# LD test_dumpcore.hvt
# ld -nostdlib -z max-page-size=0x1000 -static  -T /home/opam/.opam/5.1/.opam-switch/build/solo5-bindings-hvt.0.6.6/bindings/hvt/solo5_hvt.lds /home/opam/.opam/5.1/.opam-switch/build/solo5-bindings-hvt.0.6.6/bindings/hvt/solo5_hvt.o test_dumpcore.o manifest.o -o test_dumpcore.hvt
# ld: warning: /home/opam/.opam/5.1/.opam-switch/build/solo5-bindings-hvt.0.6.6/bindings/hvt/solo5_hvt.o: requires executable stack (because the .note.GNU-stack section is executable)
# make[2]: Leaving directory '/home/opam/.opam/5.1/.opam-switch/build/solo5-bindings-hvt.0.6.6/tests/test_dumpcore'
# MAKE test_exception
# make -C test_exception  
# make[2]: Entering directory '/home/opam/.opam/5.1/.opam-switch/build/solo5-bindings-hvt.0.6.6/tests/test_exception'
# CC test_exception.c
# cc -std=c11 -Wall -Wextra -Werror -O2 -g -ffreestanding -fstack-protector-strong -nostdinc -mstack-protector-guard=global -isystem /home/opam/.opam/5.1/.opam-switch/build/solo5-bindings-hvt.0.6.6/include/crt -I/home/opam/.opam/5.1/.opam-switch/build/solo5-bindings-hvt.0.6.6/include/solo5 -c test_exception.c -o test_exception.o
# ELFTOOL manifest.json
# /home/opam/.opam/5.1/.opam-switch/build/solo5-bindings-hvt.0.6.6/elftool/solo5-elftool gen-manifest manifest.json manifest.c
# CC manifest.c
# cc -std=c11 -Wall -Wextra -Werror -O2 -g -ffreestanding -fstack-protector-strong -nostdinc -mstack-protector-guard=global -isystem /home/opam/.opam/5.1/.opam-switch/build/solo5-bindings-hvt.0.6.6/include/crt -I/home/opam/.opam/5.1/.opam-switch/build/solo5-bindings-hvt.0.6.6/include/solo5 -c manifest.c -o manifest.o
# LD test_exception.hvt
# ld -nostdlib -z max-page-size=0x1000 -static  -T /home/opam/.opam/5.1/.opam-switch/build/solo5-bindings-hvt.0.6.6/bindings/hvt/solo5_hvt.lds /home/opam/.opam/5.1/.opam-switch/build/solo5-bindings-hvt.0.6.6/bindings/hvt/solo5_hvt.o test_exception.o manifest.o -o test_exception.hvt
# ld: warning: /home/opam/.opam/5.1/.opam-switch/build/solo5-bindings-hvt.0.6.6/bindings/hvt/solo5_hvt.o: requires executable stack (because the .note.GNU-stack section is executable)
# make[2]: Leaving directory '/home/opam/.opam/5.1/.opam-switch/build/solo5-bindings-hvt.0.6.6/tests/test_exception'
# MAKE test_fpu
# make -C test_fpu  
# make[2]: Entering directory '/home/opam/.opam/5.1/.opam-switch/build/solo5-bindings-hvt.0.6.6/tests/test_fpu'
# CC test_fpu.c
# cc -std=c11 -Wall -Wextra -Werror -O2 -g -ffreestanding -fstack-protector-strong -nostdinc -mstack-protector-guard=global -isystem /home/opam/.opam/5.1/.opam-switch/build/solo5-bindings-hvt.0.6.6/include/crt -I/home/opam/.opam/5.1/.opam-switch/build/solo5-bindings-hvt.0.6.6/include/solo5 -c test_fpu.c -o test_fpu.o
# ELFTOOL manifest.json
# /home/opam/.opam/5.1/.opam-switch/build/solo5-bindings-hvt.0.6.6/elftool/solo5-elftool gen-manifest manifest.json manifest.c
# CC manifest.c
# cc -std=c11 -Wall -Wextra -Werror -O2 -g -ffreestanding -fstack-protector-strong -nostdinc -mstack-protector-guard=global -isystem /home/opam/.opam/5.1/.opam-switch/build/solo5-bindings-hvt.0.6.6/include/crt -I/home/opam/.opam/5.1/.opam-switch/build/solo5-bindings-hvt.0.6.6/include/solo5 -c manifest.c -o manifest.o
# LD test_fpu.hvt
# ld -nostdlib -z max-page-size=0x1000 -static  -T /home/opam/.opam/5.1/.opam-switch/build/solo5-bindings-hvt.0.6.6/bindings/hvt/solo5_hvt.lds /home/opam/.opam/5.1/.opam-switch/build/solo5-bindings-hvt.0.6.6/bindings/hvt/solo5_hvt.o test_fpu.o manifest.o -o test_fpu.hvt
# ld: warning: /home/opam/.opam/5.1/.opam-switch/build/solo5-bindings-hvt.0.6.6/bindings/hvt/solo5_hvt.o: requires executable stack (because the .note.GNU-stack section is executable)
# make[2]: Leaving directory '/home/opam/.opam/5.1/.opam-switch/build/solo5-bindings-hvt.0.6.6/tests/test_fpu'
# MAKE test_globals
# make -C test_globals  
# make[2]: Entering directory '/home/opam/.opam/5.1/.opam-switch/build/solo5-bindings-hvt.0.6.6/tests/test_globals'
# CC test_globals.c
# cc -std=c11 -Wall -Wextra -Werror -O2 -g -ffreestanding -fstack-protector-strong -nostdinc -mstack-protector-guard=global -isystem /home/opam/.opam/5.1/.opam-switch/build/solo5-bindings-hvt.0.6.6/include/crt -I/home/opam/.opam/5.1/.opam-switch/build/solo5-bindings-hvt.0.6.6/include/solo5 -c test_globals.c -o test_globals.o
# ELFTOOL manifest.json
# /home/opam/.opam/5.1/.opam-switch/build/solo5-bindings-hvt.0.6.6/elftool/solo5-elftool gen-manifest manifest.json manifest.c
# CC manifest.c
# cc -std=c11 -Wall -Wextra -Werror -O2 -g -ffreestanding -fstack-protector-strong -nostdinc -mstack-protector-guard=global -isystem /home/opam/.opam/5.1/.opam-switch/build/solo5-bindings-hvt.0.6.6/include/crt -I/home/opam/.opam/5.1/.opam-switch/build/solo5-bindings-hvt.0.6.6/include/solo5 -c manifest.c -o manifest.o
# LD test_globals.hvt
# ld -nostdlib -z max-page-size=0x1000 -static  -T /home/opam/.opam/5.1/.opam-switch/build/solo5-bindings-hvt.0.6.6/bindings/hvt/solo5_hvt.lds /home/opam/.opam/5.1/.opam-switch/build/solo5-bindings-hvt.0.6.6/bindings/hvt/solo5_hvt.o test_globals.o manifest.o -o test_globals.hvt
# ld: warning: /home/opam/.opam/5.1/.opam-switch/build/solo5-bindings-hvt.0.6.6/bindings/hvt/solo5_hvt.o: requires executable stack (because the .note.GNU-stack section is executable)
# make[2]: Leaving directory '/home/opam/.opam/5.1/.opam-switch/build/solo5-bindings-hvt.0.6.6/tests/test_globals'
# MAKE test_hello
# make -C test_hello  
# make[2]: Entering directory '/home/opam/.opam/5.1/.opam-switch/build/solo5-bindings-hvt.0.6.6/tests/test_hello'
# CC test_hello.c
# cc -std=c11 -Wall -Wextra -Werror -O2 -g -ffreestanding -fstack-protector-strong -nostdinc -mstack-protector-guard=global -isystem /home/opam/.opam/5.1/.opam-switch/build/solo5-bindings-hvt.0.6.6/include/crt -I/home/opam/.opam/5.1/.opam-switch/build/solo5-bindings-hvt.0.6.6/include/solo5 -c test_hello.c -o test_hello.o
# ELFTOOL manifest.json
# /home/opam/.opam/5.1/.opam-switch/build/solo5-bindings-hvt.0.6.6/elftool/solo5-elftool gen-manifest manifest.json manifest.c
# CC manifest.c
# cc -std=c11 -Wall -Wextra -Werror -O2 -g -ffreestanding -fstack-protector-strong -nostdinc -mstack-protector-guard=global -isystem /home/opam/.opam/5.1/.opam-switch/build/solo5-bindings-hvt.0.6.6/include/crt -I/home/opam/.opam/5.1/.opam-switch/build/solo5-bindings-hvt.0.6.6/include/solo5 -c manifest.c -o manifest.o
# LD test_hello.hvt
# ld -nostdlib -z max-page-size=0x1000 -static  -T /home/opam/.opam/5.1/.opam-switch/build/solo5-bindings-hvt.0.6.6/bindings/hvt/solo5_hvt.lds /home/opam/.opam/5.1/.opam-switch/build/solo5-bindings-hvt.0.6.6/bindings/hvt/solo5_hvt.o test_hello.o manifest.o -o test_hello.hvt
# ld: warning: /home/opam/.opam/5.1/.opam-switch/build/solo5-bindings-hvt.0.6.6/bindings/hvt/solo5_hvt.o: requires executable stack (because the .note.GNU-stack section is executable)
# make[2]: Leaving directory '/home/opam/.opam/5.1/.opam-switch/build/solo5-bindings-hvt.0.6.6/tests/test_hello'
# MAKE test_mft_maxdevices
# make -C test_mft_maxdevices  
# make[2]: Entering directory '/home/opam/.opam/5.1/.opam-switch/build/solo5-bindings-hvt.0.6.6/tests/test_mft_maxdevices'
# CC test_mft_maxdevices.c
# cc -std=c11 -Wall -Wextra -Werror -O2 -g -ffreestanding -fstack-protector-strong -nostdinc -mstack-protector-guard=global -isystem /home/opam/.opam/5.1/.opam-switch/build/solo5-bindings-hvt.0.6.6/include/crt -I/home/opam/.opam/5.1/.opam-switch/build/solo5-bindings-hvt.0.6.6/include/solo5 -c test_mft_maxdevices.c -o test_mft_maxdevices.o
# ELFTOOL manifest.json
# /home/opam/.opam/5.1/.opam-switch/build/solo5-bindings-hvt.0.6.6/elftool/solo5-elftool gen-manifest manifest.json manifest.c
# CC manifest.c
# cc -std=c11 -Wall -Wextra -Werror -O2 -g -ffreestanding -fstack-protector-strong -nostdinc -mstack-protector-guard=global -isystem /home/opam/.opam/5.1/.opam-switch/build/solo5-bindings-hvt.0.6.6/include/crt -I/home/opam/.opam/5.1/.opam-switch/build/solo5-bindings-hvt.0.6.6/include/solo5 -c manifest.c -o manifest.o
# LD test_mft_maxdevices.hvt
# ld -nostdlib -z max-page-size=0x1000 -static  -T /home/opam/.opam/5.1/.opam-switch/build/solo5-bindings-hvt.0.6.6/bindings/hvt/solo5_hvt.lds /home/opam/.opam/5.1/.opam-switch/build/solo5-bindings-hvt.0.6.6/bindings/hvt/solo5_hvt.o test_mft_maxdevices.o manifest.o -o test_mft_maxdevices.hvt
# ld: warning: /home/opam/.opam/5.1/.opam-switch/build/solo5-bindings-hvt.0.6.6/bindings/hvt/solo5_hvt.o: requires executable stack (because the .note.GNU-stack section is executable)
# make[2]: Leaving directory '/home/opam/.opam/5.1/.opam-switch/build/solo5-bindings-hvt.0.6.6/tests/test_mft_maxdevices'
# MAKE test_net
# make -C test_net  
# make[2]: Entering directory '/home/opam/.opam/5.1/.opam-switch/build/solo5-bindings-hvt.0.6.6/tests/test_net'
# CC test_net.c
# cc -std=c11 -Wall -Wextra -Werror -O2 -g -ffreestanding -fstack-protector-strong -nostdinc -mstack-protector-guard=global -isystem /home/opam/.opam/5.1/.opam-switch/build/solo5-bindings-hvt.0.6.6/include/crt -I/home/opam/.opam/5.1/.opam-switch/build/solo5-bindings-hvt.0.6.6/include/solo5 -c test_net.c -o test_net.o
# ELFTOOL manifest.json
# /home/opam/.opam/5.1/.opam-switch/build/solo5-bindings-hvt.0.6.6/elftool/solo5-elftool gen-manifest manifest.json manifest.c
# CC manifest.c
# cc -std=c11 -Wall -Wextra -Werror -O2 -g -ffreestanding -fstack-protector-strong -nostdinc -mstack-protector-guard=global -isystem /home/opam/.opam/5.1/.opam-switch/build/solo5-bindings-hvt.0.6.6/include/crt -I/home/opam/.opam/5.1/.opam-switch/build/solo5-bindings-hvt.0.6.6/include/solo5 -c manifest.c -o manifest.o
# LD test_net.hvt
# ld -nostdlib -z max-page-size=0x1000 -static  -T /home/opam/.opam/5.1/.opam-switch/build/solo5-bindings-hvt.0.6.6/bindings/hvt/solo5_hvt.lds /home/opam/.opam/5.1/.opam-switch/build/solo5-bindings-hvt.0.6.6/bindings/hvt/solo5_hvt.o test_net.o manifest.o -o test_net.hvt
# ld: warning: /home/opam/.opam/5.1/.opam-switch/build/solo5-bindings-hvt.0.6.6/bindings/hvt/solo5_hvt.o: requires executable stack (because the .note.GNU-stack section is executable)
# make[2]: Leaving directory '/home/opam/.opam/5.1/.opam-switch/build/solo5-bindings-hvt.0.6.6/tests/test_net'
# MAKE test_net_2if
# make -C test_net_2if  
# make[2]: Entering directory '/home/opam/.opam/5.1/.opam-switch/build/solo5-bindings-hvt.0.6.6/tests/test_net_2if'
# CC test_net_2if.c
# cc -std=c11 -Wall -Wextra -Werror -O2 -g -ffreestanding -fstack-protector-strong -nostdinc -mstack-protector-guard=global -isystem /home/opam/.opam/5.1/.opam-switch/build/solo5-bindings-hvt.0.6.6/include/crt -I/home/opam/.opam/5.1/.opam-switch/build/solo5-bindings-hvt.0.6.6/include/solo5 -c test_net_2if.c -o test_net_2if.o
# ELFTOOL manifest.json
# /home/opam/.opam/5.1/.opam-switch/build/solo5-bindings-hvt.0.6.6/elftool/solo5-elftool gen-manifest manifest.json manifest.c
# CC manifest.c
# cc -std=c11 -Wall -Wextra -Werror -O2 -g -ffreestanding -fstack-protector-strong -nostdinc -mstack-protector-guard=global -isystem /home/opam/.opam/5.1/.opam-switch/build/solo5-bindings-hvt.0.6.6/include/crt -I/home/opam/.opam/5.1/.opam-switch/build/solo5-bindings-hvt.0.6.6/include/solo5 -c manifest.c -o manifest.o
# LD test_net_2if.hvt
# ld -nostdlib -z max-page-size=0x1000 -static  -T /home/opam/.opam/5.1/.opam-switch/build/solo5-bindings-hvt.0.6.6/bindings/hvt/solo5_hvt.lds /home/opam/.opam/5.1/.opam-switch/build/solo5-bindings-hvt.0.6.6/bindings/hvt/solo5_hvt.o test_net_2if.o manifest.o -o test_net_2if.hvt
# ld: warning: /home/opam/.opam/5.1/.opam-switch/build/solo5-bindings-hvt.0.6.6/bindings/hvt/solo5_hvt.o: requires executable stack (because the .note.GNU-stack section is executable)
# make[2]: Leaving directory '/home/opam/.opam/5.1/.opam-switch/build/solo5-bindings-hvt.0.6.6/tests/test_net_2if'
# MAKE test_notls
# make -C test_notls  
# make[2]: Entering directory '/home/opam/.opam/5.1/.opam-switch/build/solo5-bindings-hvt.0.6.6/tests/test_notls'
# CC test_notls.c
# cc -std=c11 -Wall -Wextra -Werror -O2 -g -ffreestanding -fstack-protector-strong -nostdinc -mstack-protector-guard=global -isystem /home/opam/.opam/5.1/.opam-switch/build/solo5-bindings-hvt.0.6.6/include/crt -I/home/opam/.opam/5.1/.opam-switch/build/solo5-bindings-hvt.0.6.6/include/solo5 -c test_notls.c -o test_notls.o
# ELFTOOL manifest.json
# /home/opam/.opam/5.1/.opam-switch/build/solo5-bindings-hvt.0.6.6/elftool/solo5-elftool gen-manifest manifest.json manifest.c
# CC manifest.c
# cc -std=c11 -Wall -Wextra -Werror -O2 -g -ffreestanding -fstack-protector-strong -nostdinc -mstack-protector-guard=global -isystem /home/opam/.opam/5.1/.opam-switch/build/solo5-bindings-hvt.0.6.6/include/crt -I/home/opam/.opam/5.1/.opam-switch/build/solo5-bindings-hvt.0.6.6/include/solo5 -c manifest.c -o manifest.o
# LD test_notls.hvt
# ld -nostdlib -z max-page-size=0x1000 -static  -T /home/opam/.opam/5.1/.opam-switch/build/solo5-bindings-hvt.0.6.6/bindings/hvt/solo5_hvt.lds /home/opam/.opam/5.1/.opam-switch/build/solo5-bindings-hvt.0.6.6/bindings/hvt/solo5_hvt.o test_notls.o manifest.o -o test_notls.hvt
# ld: warning: /home/opam/.opam/5.1/.opam-switch/build/solo5-bindings-hvt.0.6.6/bindings/hvt/solo5_hvt.o: requires executable stack (because the .note.GNU-stack section is executable)
# make[2]: Leaving directory '/home/opam/.opam/5.1/.opam-switch/build/solo5-bindings-hvt.0.6.6/tests/test_notls'
# MAKE test_quiet
# make -C test_quiet  
# make[2]: Entering directory '/home/opam/.opam/5.1/.opam-switch/build/solo5-bindings-hvt.0.6.6/tests/test_quiet'
# CC test_quiet.c
# cc -std=c11 -Wall -Wextra -Werror -O2 -g -ffreestanding -fstack-protector-strong -nostdinc -mstack-protector-guard=global -isystem /home/opam/.opam/5.1/.opam-switch/build/solo5-bindings-hvt.0.6.6/include/crt -I/home/opam/.opam/5.1/.opam-switch/build/solo5-bindings-hvt.0.6.6/include/solo5 -c test_quiet.c -o test_quiet.o
# ELFTOOL manifest.json
# /home/opam/.opam/5.1/.opam-switch/build/solo5-bindings-hvt.0.6.6/elftool/solo5-elftool gen-manifest manifest.json manifest.c
# CC manifest.c
# cc -std=c11 -Wall -Wextra -Werror -O2 -g -ffreestanding -fstack-protector-strong -nostdinc -mstack-protector-guard=global -isystem /home/opam/.opam/5.1/.opam-switch/build/solo5-bindings-hvt.0.6.6/include/crt -I/home/opam/.opam/5.1/.opam-switch/build/solo5-bindings-hvt.0.6.6/include/solo5 -c manifest.c -o manifest.o
# LD test_quiet.hvt
# ld -nostdlib -z max-page-size=0x1000 -static  -T /home/opam/.opam/5.1/.opam-switch/build/solo5-bindings-hvt.0.6.6/bindings/hvt/solo5_hvt.lds /home/opam/.opam/5.1/.opam-switch/build/solo5-bindings-hvt.0.6.6/bindings/hvt/solo5_hvt.o test_quiet.o manifest.o -o test_quiet.hvt
# ld: warning: /home/opam/.opam/5.1/.opam-switch/build/solo5-bindings-hvt.0.6.6/bindings/hvt/solo5_hvt.o: requires executable stack (because the .note.GNU-stack section is executable)
# make[2]: Leaving directory '/home/opam/.opam/5.1/.opam-switch/build/solo5-bindings-hvt.0.6.6/tests/test_quiet'
# MAKE test_seccomp
# make -C test_seccomp  
# make[2]: Entering directory '/home/opam/.opam/5.1/.opam-switch/build/solo5-bindings-hvt.0.6.6/tests/test_seccomp'
# make[2]: Nothing to be done for 'all'.
# make[2]: Leaving directory '/home/opam/.opam/5.1/.opam-switch/build/solo5-bindings-hvt.0.6.6/tests/test_seccomp'
# MAKE test_ssp
# make -C test_ssp  
# make[2]: Entering directory '/home/opam/.opam/5.1/.opam-switch/build/solo5-bindings-hvt.0.6.6/tests/test_ssp'
# CC test_ssp.c
# cc -std=c11 -Wall -Wextra -Werror -O2 -g -ffreestanding -fstack-protector-strong -nostdinc -mstack-protector-guard=global -isystem /home/opam/.opam/5.1/.opam-switch/build/solo5-bindings-hvt.0.6.6/include/crt -I/home/opam/.opam/5.1/.opam-switch/build/solo5-bindings-hvt.0.6.6/include/solo5 -c test_ssp.c -o test_ssp.o
# ELFTOOL manifest.json
# /home/opam/.opam/5.1/.opam-switch/build/solo5-bindings-hvt.0.6.6/elftool/solo5-elftool gen-manifest manifest.json manifest.c
# CC manifest.c
# cc -std=c11 -Wall -Wextra -Werror -O2 -g -ffreestanding -fstack-protector-strong -nostdinc -mstack-protector-guard=global -isystem /home/opam/.opam/5.1/.opam-switch/build/solo5-bindings-hvt.0.6.6/include/crt -I/home/opam/.opam/5.1/.opam-switch/build/solo5-bindings-hvt.0.6.6/include/solo5 -c manifest.c -o manifest.o
# LD test_ssp.hvt
# ld -nostdlib -z max-page-size=0x1000 -static  -T /home/opam/.opam/5.1/.opam-switch/build/solo5-bindings-hvt.0.6.6/bindings/hvt/solo5_hvt.lds /home/opam/.opam/5.1/.opam-switch/build/solo5-bindings-hvt.0.6.6/bindings/hvt/solo5_hvt.o test_ssp.o manifest.o -o test_ssp.hvt
# ld: warning: /home/opam/.opam/5.1/.opam-switch/build/solo5-bindings-hvt.0.6.6/bindings/hvt/solo5_hvt.o: requires executable stack (because the .note.GNU-stack section is executable)
# make[2]: Leaving directory '/home/opam/.opam/5.1/.opam-switch/build/solo5-bindings-hvt.0.6.6/tests/test_ssp'
# MAKE test_time
# make -C test_time  
# make[2]: Entering directory '/home/opam/.opam/5.1/.opam-switch/build/solo5-bindings-hvt.0.6.6/tests/test_time'
# CC test_time.c
# cc -std=c11 -Wall -Wextra -Werror -O2 -g -ffreestanding -fstack-protector-strong -nostdinc -mstack-protector-guard=global -isystem /home/opam/.opam/5.1/.opam-switch/build/solo5-bindings-hvt.0.6.6/include/crt -I/home/opam/.opam/5.1/.opam-switch/build/solo5-bindings-hvt.0.6.6/include/solo5 -c test_time.c -o test_time.o
# ELFTOOL manifest.json
# /home/opam/.opam/5.1/.opam-switch/build/solo5-bindings-hvt.0.6.6/elftool/solo5-elftool gen-manifest manifest.json manifest.c
# CC manifest.c
# cc -std=c11 -Wall -Wextra -Werror -O2 -g -ffreestanding -fstack-protector-strong -nostdinc -mstack-protector-guard=global -isystem /home/opam/.opam/5.1/.opam-switch/build/solo5-bindings-hvt.0.6.6/include/crt -I/home/opam/.opam/5.1/.opam-switch/build/solo5-bindings-hvt.0.6.6/include/solo5 -c manifest.c -o manifest.o
# LD test_time.hvt
# ld -nostdlib -z max-page-size=0x1000 -static  -T /home/opam/.opam/5.1/.opam-switch/build/solo5-bindings-hvt.0.6.6/bindings/hvt/solo5_hvt.lds /home/opam/.opam/5.1/.opam-switch/build/solo5-bindings-hvt.0.6.6/bindings/hvt/solo5_hvt.o test_time.o manifest.o -o test_time.hvt
# ld: warning: /home/opam/.opam/5.1/.opam-switch/build/solo5-bindings-hvt.0.6.6/bindings/hvt/solo5_hvt.o: requires executable stack (because the .note.GNU-stack section is executable)
# make[2]: Leaving directory '/home/opam/.opam/5.1/.opam-switch/build/solo5-bindings-hvt.0.6.6/tests/test_time'
# MAKE test_tls
# make -C test_tls  
# make[2]: Entering directory '/home/opam/.opam/5.1/.opam-switch/build/solo5-bindings-hvt.0.6.6/tests/test_tls'
# CC test_tls.c
# cc -std=c11 -Wall -Wextra -Werror -O2 -g -ffreestanding -fstack-protector-strong -nostdinc -mstack-protector-guard=global -isystem /home/opam/.opam/5.1/.opam-switch/build/solo5-bindings-hvt.0.6.6/include/crt -I/home/opam/.opam/5.1/.opam-switch/build/solo5-bindings-hvt.0.6.6/include/solo5 -c test_tls.c -o test_tls.o
# ELFTOOL manifest.json
# /home/opam/.opam/5.1/.opam-switch/build/solo5-bindings-hvt.0.6.6/elftool/solo5-elftool gen-manifest manifest.json manifest.c
# CC manifest.c
# cc -std=c11 -Wall -Wextra -Werror -O2 -g -ffreestanding -fstack-protector-strong -nostdinc -mstack-protector-guard=global -isystem /home/opam/.opam/5.1/.opam-switch/build/solo5-bindings-hvt.0.6.6/include/crt -I/home/opam/.opam/5.1/.opam-switch/build/solo5-bindings-hvt.0.6.6/include/solo5 -c manifest.c -o manifest.o
# LD test_tls.hvt
# ld -nostdlib -z max-page-size=0x1000 -static  -T /home/opam/.opam/5.1/.opam-switch/build/solo5-bindings-hvt.0.6.6/bindings/hvt/solo5_hvt.lds /home/opam/.opam/5.1/.opam-switch/build/solo5-bindings-hvt.0.6.6/bindings/hvt/solo5_hvt.o test_tls.o manifest.o -o test_tls.hvt
# ld: warning: /home/opam/.opam/5.1/.opam-switch/build/solo5-bindings-hvt.0.6.6/bindings/hvt/solo5_hvt.o: requires executable stack (because the .note.GNU-stack section is executable)
# make[2]: Leaving directory '/home/opam/.opam/5.1/.opam-switch/build/solo5-bindings-hvt.0.6.6/tests/test_tls'
# MAKE test_wnox
# make -C test_wnox  
# make[2]: Entering directory '/home/opam/.opam/5.1/.opam-switch/build/solo5-bindings-hvt.0.6.6/tests/test_wnox'
# CC test_wnox.c
# cc -std=c11 -Wall -Wextra -Werror -O2 -g -ffreestanding -fstack-protector-strong -nostdinc -mstack-protector-guard=global -isystem /home/opam/.opam/5.1/.opam-switch/build/solo5-bindings-hvt.0.6.6/include/crt -I/home/opam/.opam/5.1/.opam-switch/build/solo5-bindings-hvt.0.6.6/include/solo5 -c test_wnox.c -o test_wnox.o
# /opam-tmp/ccGoap8O.s: Assembler messages:
# /opam-tmp/ccGoap8O.s:726: Warning: ignoring changed section attributes for .data
# /opam-tmp/ccGoap8O.s:733: Warning: dwarf line number information for .data ignored
# /opam-tmp/ccGoap8O.s:735: Warning: dwarf line number information for .data ignored
# /opam-tmp/ccGoap8O.s:736: Warning: dwarf line number information for .data ignored
# ELFTOOL manifest.json
# /home/opam/.opam/5.1/.opam-switch/build/solo5-bindings-hvt.0.6.6/elftool/solo5-elftool gen-manifest manifest.json manifest.c
# CC manifest.c
# cc -std=c11 -Wall -Wextra -Werror -O2 -g -ffreestanding -fstack-protector-strong -nostdinc -mstack-protector-guard=global -isystem /home/opam/.opam/5.1/.opam-switch/build/solo5-bindings-hvt.0.6.6/include/crt -I/home/opam/.opam/5.1/.opam-switch/build/solo5-bindings-hvt.0.6.6/include/solo5 -c manifest.c -o manifest.o
# LD test_wnox.hvt
# ld -nostdlib -z max-page-size=0x1000 -static  -T /home/opam/.opam/5.1/.opam-switch/build/solo5-bindings-hvt.0.6.6/bindings/hvt/solo5_hvt.lds /home/opam/.opam/5.1/.opam-switch/build/solo5-bindings-hvt.0.6.6/bindings/hvt/solo5_hvt.o test_wnox.o manifest.o -o test_wnox.hvt
# ld: warning: /home/opam/.opam/5.1/.opam-switch/build/solo5-bindings-hvt.0.6.6/bindings/hvt/solo5_hvt.o: requires executable stack (because the .note.GNU-stack section is executable)
# make[2]: Leaving directory '/home/opam/.opam/5.1/.opam-switch/build/solo5-bindings-hvt.0.6.6/tests/test_wnox'
# MAKE test_xnow
# make -C test_xnow  
# make[2]: Entering directory '/home/opam/.opam/5.1/.opam-switch/build/solo5-bindings-hvt.0.6.6/tests/test_xnow'
# CC test_xnow.c
# cc -std=c11 -Wall -Wextra -Werror -O2 -g -ffreestanding -fstack-protector-strong -nostdinc -mstack-protector-guard=global -isystem /home/opam/.opam/5.1/.opam-switch/build/solo5-bindings-hvt.0.6.6/include/crt -I/home/opam/.opam/5.1/.opam-switch/build/solo5-bindings-hvt.0.6.6/include/solo5 -c test_xnow.c -o test_xnow.o
# ELFTOOL manifest.json
# /home/opam/.opam/5.1/.opam-switch/build/solo5-bindings-hvt.0.6.6/elftool/solo5-elftool gen-manifest manifest.json manifest.c
# CC manifest.c
# cc -std=c11 -Wall -Wextra -Werror -O2 -g -ffreestanding -fstack-protector-strong -nostdinc -mstack-protector-guard=global -isystem /home/opam/.opam/5.1/.opam-switch/build/solo5-bindings-hvt.0.6.6/include/crt -I/home/opam/.opam/5.1/.opam-switch/build/solo5-bindings-hvt.0.6.6/include/solo5 -c manifest.c -o manifest.o
# LD test_xnow.hvt
# ld -nostdlib -z max-page-size=0x1000 -static  -T /home/opam/.opam/5.1/.opam-switch/build/solo5-bindings-hvt.0.6.6/bindings/hvt/solo5_hvt.lds /home/opam/.opam/5.1/.opam-switch/build/solo5-bindings-hvt.0.6.6/bindings/hvt/solo5_hvt.o test_xnow.o manifest.o -o test_xnow.hvt
# ld: warning: /home/opam/.opam/5.1/.opam-switch/build/solo5-bindings-hvt.0.6.6/bindings/hvt/solo5_hvt.o: requires executable stack (because the .note.GNU-stack section is executable)
# make[2]: Leaving directory '/home/opam/.opam/5.1/.opam-switch/build/solo5-bindings-hvt.0.6.6/tests/test_xnow'
# MAKE test_zeropage
# make -C test_zeropage  
# make[2]: Entering directory '/home/opam/.opam/5.1/.opam-switch/build/solo5-bindings-hvt.0.6.6/tests/test_zeropage'
# CC test_zeropage.c
# cc -std=c11 -Wall -Wextra -Werror -O2 -g -ffreestanding -fstack-protector-strong -nostdinc -mstack-protector-guard=global -isystem /home/opam/.opam/5.1/.opam-switch/build/solo5-bindings-hvt.0.6.6/include/crt -I/home/opam/.opam/5.1/.opam-switch/build/solo5-bindings-hvt.0.6.6/include/solo5 -c test_zeropage.c -o test_zeropage.o
# test_zeropage.c: In function 'solo5_app_main':
# test_zeropage.c:39:5: error: array subscript 0 is outside array bounds of 'uint64_t[0]' {aka 'long unsigned int[]'} [-Werror=array-bounds]
#    39 |     *addr_invalid = 1;
#       |     ^~~~~~~~~~~~~
# cc1: all warnings being treated as errors
# make[2]: *** [../Makefile.tests:51: test_zeropage.o] Error 1
# make[2]: Leaving directory '/home/opam/.opam/5.1/.opam-switch/build/solo5-bindings-hvt.0.6.6/tests/test_zeropage'
# make[1]: *** [GNUmakefile:33: test_zeropage] Error 2
# make[1]: Leaving directory '/home/opam/.opam/5.1/.opam-switch/build/solo5-bindings-hvt.0.6.6/tests'
# make: *** [GNUmakefile:70: tests] Error 2



<><> Error report <><><><><><><><><><><><><><><><><><><><><><><><><><><><><><><>
+- The following actions failed
| - build solo5-bindings-hvt 0.6.6
+- 
+- The following changes have been performed
| - install conf-libseccomp 1
+- 
# Run eval $(opam env) to update the current shell environment

The former state can be restored with:
    /usr/bin/opam switch import "/home/opam/.opam/5.1/.opam-switch/backup/state-20240212200714.export"
[WARNING] OPAMCONFIRMLEVEL was ignored because CLI 2.0 was requested and it was introduced in 2.1.
[WARNING] OPAMCONFIRMLEVEL was ignored because CLI 2.0 was requested and it was introduced in 2.1.
"/usr/bin/env" "bash" "-c" "opam reinstall solo5-bindings-hvt.0.6.6;
        res=$?;
        test "$res" != 31 && exit "$res";
        export OPAMCLI=2.0;
        build_dir=$(opam var prefix)/.opam-switch/build;
        failed=$(ls "$build_dir");
        partial_fails="";
        for pkg in $failed; do
          if opam show -f x-ci-accept-failures: "$pkg" | grep -qF "\"debian-12\""; then
            echo "A package failed and has been disabled for CI using the 'x-ci-accept-failures' field.";
          fi;
          test "$pkg" != 'solo5-bindings-hvt.0.6.6' && partial_fails="$partial_fails $pkg";
        done;
        test "${partial_fails}" != "" && echo "opam-repo-ci detected dependencies failing: ${partial_fails}";
        exit 1" failed with exit status 1
2024-02-12 20:07.47: Job failed: Failed: Build failed
2024-02-12 20:07.47: Log analysis:
2024-02-12 20:07.47: >>> 
[ERROR] The compilation of solo5-bindings-hvt.0.6.6 failed at "make V=1 CONFIG_SPT= CONFIG_VIRTIO= CONFIG_MUEN= CONFIG_GENODE= CONFIG_XEN=".
 (score = 20)
2024-02-12 20:07.47: >>> 
# test_zeropage.c:39:5: error: array subscript 0 is outside array bounds of 'uint64_t[0]' {aka 'long unsigned int[]'} [-Werror=array-bounds]
 (score = 30)
2024-02-12 20:07.47: array subscript 0 is outside array bounds of 'uint64_t[0]' {aka 'long unsigned int[]'} [-Werror=array-bounds]