Build:
  1. 0
2024-02-11 20:23.53: New job: test systemverilog.0.0.1 with conf-pkg-config.1.1, using opam dev
                              from https://github.com/ocaml/opam-repository.git#refs/pull/25235/head (8c7391d6ec81e93f24de221eb32a886b72d1ede6)
                              on debian-12-ocaml-5.1/amd64

To reproduce locally:

cd $(mktemp -d)
git clone --recursive "https://github.com/ocaml/opam-repository.git" && cd "opam-repository" && git fetch origin "refs/pull/25235/head" && git reset --hard 8c7391d6
git fetch origin master
git merge --no-edit 8477e9a74beb40d85534ab7653b65d45607a147f
cat > ../Dockerfile <<'END-OF-DOCKERFILE'
FROM ocaml/opam:debian-12-ocaml-5.1@sha256:931805f2c2fdb0b5642ae8463ff0780c2ee3f4afb48734a7d94e2d5163429930
USER 1000:1000
WORKDIR /home/opam
RUN sudo ln -f /usr/bin/opam-dev /usr/bin/opam
RUN opam init --reinit -ni
ENV OPAMDOWNLOADJOBS="1"
ENV OPAMERRLOGLEN="0"
ENV OPAMSOLVERTIMEOUT="500"
ENV OPAMPRECISETRACKING="1"
ENV CI="true"
ENV OPAM_REPO_CI="true"
RUN rm -rf opam-repository/
COPY --chown=1000:1000 . opam-repository/
RUN opam repository set-url --strict default opam-repository/
RUN opam update --depexts || true
ENV OPAMCRITERIA="-removed,-count[avoid-version,changed],-count[version-lag,request],-count[version-lag,changed],-count[missing-depexts,changed],-changed"
ENV OPAMFIXUPCRITERIA="-removed,-count[avoid-version,changed],-count[version-lag,request],-count[version-lag,changed],-count[missing-depexts,changed],-changed"
ENV OPAMUPGRADECRITERIA="-removed,-count[avoid-version,changed],-count[version-lag,request],-count[version-lag,changed],-count[missing-depexts,changed],-changed"
RUN opam pin add -k version -yn conf-pkg-config.1.1 1.1
RUN opam reinstall conf-pkg-config.1.1; \
    res=$?; \
    test "$res" != 31 && exit "$res"; \
    export OPAMCLI=2.0; \
    build_dir=$(opam var prefix)/.opam-switch/build; \
    failed=$(ls "$build_dir"); \
    partial_fails=""; \
    for pkg in $failed; do \
    if opam show -f x-ci-accept-failures: "$pkg" | grep -qF "\"debian-12\""; then \
    echo "A package failed and has been disabled for CI using the 'x-ci-accept-failures' field."; \
    fi; \
    test "$pkg" != 'conf-pkg-config.1.1' && partial_fails="$partial_fails $pkg"; \
    done; \
    test "${partial_fails}" != "" && echo "opam-repo-ci detected dependencies failing: ${partial_fails}"; \
    exit 1
ENV OPAMCRITERIA="-removed,-count[avoid-version,changed],-count[version-lag,request],-count[version-lag,changed],-count[missing-depexts,changed],-changed"
ENV OPAMFIXUPCRITERIA="-removed,-count[avoid-version,changed],-count[version-lag,request],-count[version-lag,changed],-count[missing-depexts,changed],-changed"
ENV OPAMUPGRADECRITERIA="-removed,-count[avoid-version,changed],-count[version-lag,request],-count[version-lag,changed],-count[missing-depexts,changed],-changed"
RUN opam reinstall systemverilog.0.0.1; \
    res=$?; \
    test "$res" != 31 && exit "$res"; \
    export OPAMCLI=2.0; \
    build_dir=$(opam var prefix)/.opam-switch/build; \
    failed=$(ls "$build_dir"); \
    partial_fails=""; \
    for pkg in $failed; do \
    if opam show -f x-ci-accept-failures: "$pkg" | grep -qF "\"debian-12\""; then \
    echo "A package failed and has been disabled for CI using the 'x-ci-accept-failures' field."; \
    fi; \
    test "$pkg" != 'systemverilog.0.0.1' && partial_fails="$partial_fails $pkg"; \
    done; \
    test "${partial_fails}" != "" && echo "opam-repo-ci detected dependencies failing: ${partial_fails}"; \
    exit 1
ENV OPAMCRITERIA="-removed,-count[avoid-version,changed],-count[version-lag,request],-count[version-lag,changed],-count[missing-depexts,changed],-changed"
ENV OPAMFIXUPCRITERIA="-removed,-count[avoid-version,changed],-count[version-lag,request],-count[version-lag,changed],-count[missing-depexts,changed],-changed"
ENV OPAMUPGRADECRITERIA="-removed,-count[avoid-version,changed],-count[version-lag,request],-count[version-lag,changed],-count[missing-depexts,changed],-changed"
RUN (opam reinstall --with-test systemverilog.0.0.1) || true
RUN opam reinstall --with-test --verbose systemverilog.0.0.1; \
    res=$?; \
    test "$res" != 31 && exit "$res"; \
    export OPAMCLI=2.0; \
    build_dir=$(opam var prefix)/.opam-switch/build; \
    failed=$(ls "$build_dir"); \
    partial_fails=""; \
    for pkg in $failed; do \
    if opam show -f x-ci-accept-failures: "$pkg" | grep -qF "\"debian-12\""; then \
    echo "A package failed and has been disabled for CI using the 'x-ci-accept-failures' field."; \
    fi; \
    test "$pkg" != 'systemverilog.0.0.1' && partial_fails="$partial_fails $pkg"; \
    done; \
    test "${partial_fails}" != "" && echo "opam-repo-ci detected dependencies failing: ${partial_fails}"; \
    exit 1

END-OF-DOCKERFILE
docker build -f ../Dockerfile .

2024-02-11 20:23.53: Using cache hint "ocaml/opam:debian-12-ocaml-5.1@sha256:931805f2c2fdb0b5642ae8463ff0780c2ee3f4afb48734a7d94e2d5163429930-conf-pkg-config.1.1-systemverilog.0.0.1-8c7391d6ec81e93f24de221eb32a886b72d1ede6"
2024-02-11 20:23.53: Using OBuilder spec:
((from ocaml/opam:debian-12-ocaml-5.1@sha256:931805f2c2fdb0b5642ae8463ff0780c2ee3f4afb48734a7d94e2d5163429930)
 (user (uid 1000) (gid 1000))
 (workdir /home/opam)
 (run (shell "sudo ln -f /usr/bin/opam-dev /usr/bin/opam"))
 (run (network host)
      (shell "opam init --reinit --config .opamrc-sandbox -ni"))
 (env OPAMDOWNLOADJOBS 1)
 (env OPAMERRLOGLEN 0)
 (env OPAMSOLVERTIMEOUT 500)
 (env OPAMPRECISETRACKING 1)
 (env CI true)
 (env OPAM_REPO_CI true)
 (run (shell "rm -rf opam-repository/"))
 (copy (src .) (dst opam-repository/))
 (run (shell "opam repository set-url --strict default opam-repository/"))
 (run (network host)
      (shell "opam update --depexts || true"))
 (env OPAMCRITERIA -removed,-count[avoid-version,changed],-count[version-lag,request],-count[version-lag,changed],-count[missing-depexts,changed],-changed)
 (env OPAMFIXUPCRITERIA -removed,-count[avoid-version,changed],-count[version-lag,request],-count[version-lag,changed],-count[missing-depexts,changed],-changed)
 (env OPAMUPGRADECRITERIA -removed,-count[avoid-version,changed],-count[version-lag,request],-count[version-lag,changed],-count[missing-depexts,changed],-changed)
 (run (shell "opam pin add -k version -yn conf-pkg-config.1.1 1.1"))
 (run (cache (opam-archives (target /home/opam/.opam/download-cache)))
      (network host)
      (shell  "opam reinstall conf-pkg-config.1.1;\
             \n        res=$?;\
             \n        test \"$res\" != 31 && exit \"$res\";\
             \n        export OPAMCLI=2.0;\
             \n        build_dir=$(opam var prefix)/.opam-switch/build;\
             \n        failed=$(ls \"$build_dir\");\
             \n        partial_fails=\"\";\
             \n        for pkg in $failed; do\
             \n          if opam show -f x-ci-accept-failures: \"$pkg\" | grep -qF \"\\\"debian-12\\\"\"; then\
             \n            echo \"A package failed and has been disabled for CI using the 'x-ci-accept-failures' field.\";\
             \n          fi;\
             \n          test \"$pkg\" != 'conf-pkg-config.1.1' && partial_fails=\"$partial_fails $pkg\";\
             \n        done;\
             \n        test \"${partial_fails}\" != \"\" && echo \"opam-repo-ci detected dependencies failing: ${partial_fails}\";\
             \n        exit 1"))
 (env OPAMCRITERIA -removed,-count[avoid-version,changed],-count[version-lag,request],-count[version-lag,changed],-count[missing-depexts,changed],-changed)
 (env OPAMFIXUPCRITERIA -removed,-count[avoid-version,changed],-count[version-lag,request],-count[version-lag,changed],-count[missing-depexts,changed],-changed)
 (env OPAMUPGRADECRITERIA -removed,-count[avoid-version,changed],-count[version-lag,request],-count[version-lag,changed],-count[missing-depexts,changed],-changed)
 (run (cache (opam-archives (target /home/opam/.opam/download-cache)))
      (network host)
      (shell  "opam reinstall systemverilog.0.0.1;\
             \n        res=$?;\
             \n        test \"$res\" != 31 && exit \"$res\";\
             \n        export OPAMCLI=2.0;\
             \n        build_dir=$(opam var prefix)/.opam-switch/build;\
             \n        failed=$(ls \"$build_dir\");\
             \n        partial_fails=\"\";\
             \n        for pkg in $failed; do\
             \n          if opam show -f x-ci-accept-failures: \"$pkg\" | grep -qF \"\\\"debian-12\\\"\"; then\
             \n            echo \"A package failed and has been disabled for CI using the 'x-ci-accept-failures' field.\";\
             \n          fi;\
             \n          test \"$pkg\" != 'systemverilog.0.0.1' && partial_fails=\"$partial_fails $pkg\";\
             \n        done;\
             \n        test \"${partial_fails}\" != \"\" && echo \"opam-repo-ci detected dependencies failing: ${partial_fails}\";\
             \n        exit 1"))
 (env OPAMCRITERIA -removed,-count[avoid-version,changed],-count[version-lag,request],-count[version-lag,changed],-count[missing-depexts,changed],-changed)
 (env OPAMFIXUPCRITERIA -removed,-count[avoid-version,changed],-count[version-lag,request],-count[version-lag,changed],-count[missing-depexts,changed],-changed)
 (env OPAMUPGRADECRITERIA -removed,-count[avoid-version,changed],-count[version-lag,request],-count[version-lag,changed],-count[missing-depexts,changed],-changed)
 (run (network host)
      (shell "(opam reinstall --with-test systemverilog.0.0.1) || true"))
 (run (shell  "opam reinstall --with-test --verbose systemverilog.0.0.1;\
             \n        res=$?;\
             \n        test \"$res\" != 31 && exit \"$res\";\
             \n        export OPAMCLI=2.0;\
             \n        build_dir=$(opam var prefix)/.opam-switch/build;\
             \n        failed=$(ls \"$build_dir\");\
             \n        partial_fails=\"\";\
             \n        for pkg in $failed; do\
             \n          if opam show -f x-ci-accept-failures: \"$pkg\" | grep -qF \"\\\"debian-12\\\"\"; then\
             \n            echo \"A package failed and has been disabled for CI using the 'x-ci-accept-failures' field.\";\
             \n          fi;\
             \n          test \"$pkg\" != 'systemverilog.0.0.1' && partial_fails=\"$partial_fails $pkg\";\
             \n        done;\
             \n        test \"${partial_fails}\" != \"\" && echo \"opam-repo-ci detected dependencies failing: ${partial_fails}\";\
             \n        exit 1"))
)

2024-02-11 20:23.53: Waiting for resource in pool OCluster
2024-02-12 19:58.48: Waiting for worker…
2024-02-12 20:05.22: Got resource from pool OCluster
Building on marpe.caelum.ci.dev
All commits already cached
HEAD is now at 8477e9a74b Merge pull request #25221 from nberth/mlgmpidl-1.3.0
Updating 8477e9a74b..8c7391d6ec
Fast-forward
 packages/conf-pkg-config/conf-pkg-config.1.0/opam | 2 +-
 packages/conf-pkg-config/conf-pkg-config.1.1/opam | 1 +
 packages/conf-pkg-config/conf-pkg-config.1.2/opam | 1 +
 packages/conf-pkg-config/conf-pkg-config.1.3/opam | 1 +
 packages/conf-pkg-config/conf-pkg-config.2/opam   | 1 +
 packages/conf-pkg-config/conf-pkg-config.3/opam   | 4 +++-
 6 files changed, 8 insertions(+), 2 deletions(-)

(from ocaml/opam:debian-12-ocaml-5.1@sha256:931805f2c2fdb0b5642ae8463ff0780c2ee3f4afb48734a7d94e2d5163429930)
2024-02-12 20:05.28 ---> using "4df7ce52b8e0afe130cbfff7d9b001e43cae58bd8e8710cd073ce7c11b1c6ac8" from cache

/: (user (uid 1000) (gid 1000))

/: (workdir /home/opam)

/home/opam: (run (shell "sudo ln -f /usr/bin/opam-dev /usr/bin/opam"))
2024-02-12 20:05.28 ---> using "2ee14a5dbb7aa54ab1dfa5adba4422c5a5483941525d4174e8eeed0c4c5e97aa" from cache

/home/opam: (run (network host)
                 (shell "opam init --reinit --config .opamrc-sandbox -ni"))
Configuring from /home/opam/.opamrc-sandbox, then /home/opam/.opamrc, and finally from built-in defaults.
Checking for available remotes: rsync and local, git.
  - you won't be able to use mercurial repositories unless you install the hg command on your system.
  - you won't be able to use darcs repositories unless you install the darcs command on your system.

This development version of opam requires an update to the layout of /home/opam/.opam from version 2.0 to version 2.2~alpha, which can't be reverted.
You may want to back it up before going further.

Continue? [y/n] y
[NOTE] The 'jobs' option was reset, its value was 71 and its new value will vary according to the current number of cores on your machine. You can restore the fixed value using:
           opam option jobs=71 --global
Format upgrade done.

<><> Updating repositories ><><><><><><><><><><><><><><><><><><><><><><><><><><>
[default] synchronised from file:///home/opam/opam-repository
2024-02-12 20:05.28 ---> using "d58131e4d084860f74dbebecfc9a35ebb7fbb42cf58093b5ac6cf0adf11ed898" from cache

/home/opam: (env OPAMDOWNLOADJOBS 1)

/home/opam: (env OPAMERRLOGLEN 0)

/home/opam: (env OPAMSOLVERTIMEOUT 500)

/home/opam: (env OPAMPRECISETRACKING 1)

/home/opam: (env CI true)

/home/opam: (env OPAM_REPO_CI true)

/home/opam: (run (shell "rm -rf opam-repository/"))
2024-02-12 20:05.28 ---> using "e76676ee91f5598b65d18de047738848e5af056a75e3436903dc82ff5702c5a6" from cache

/home/opam: (copy (src .) (dst opam-repository/))
2024-02-12 20:05.29 ---> using "00dcf922e87fec2f8ccdd0b44355d41faed143c596db4bfe8812d0e9c5f33f02" from cache

/home/opam: (run (shell "opam repository set-url --strict default opam-repository/"))
[default] Initialised
2024-02-12 20:05.29 ---> using "d6c8604b98b9d01914259989eafdfad7780b6c9f761a469dfe3162a56ba73510" from cache

/home/opam: (run (network host)
                 (shell "opam update --depexts || true"))
+ /usr/bin/sudo "apt-get" "update"
- Get:1 http://deb.debian.org/debian bookworm InRelease [151 kB]
- Get:2 http://deb.debian.org/debian bookworm-updates InRelease [52.1 kB]
- Get:3 http://deb.debian.org/debian-security bookworm-security InRelease [48.0 kB]
- Get:4 http://deb.debian.org/debian bookworm/main amd64 Packages [8786 kB]
- Get:5 http://deb.debian.org/debian-security bookworm-security/main amd64 Packages [137 kB]
- Fetched 9175 kB in 1s (7250 kB/s)
- Reading package lists...
2024-02-12 20:05.29 ---> using "6245d7929b862e6b37f451133c05d21883283d0248743f67197f2e424fe52d69" from cache

/home/opam: (env OPAMCRITERIA -removed,-count[avoid-version,changed],-count[version-lag,request],-count[version-lag,changed],-count[missing-depexts,changed],-changed)

/home/opam: (env OPAMFIXUPCRITERIA -removed,-count[avoid-version,changed],-count[version-lag,request],-count[version-lag,changed],-count[missing-depexts,changed],-changed)

/home/opam: (env OPAMUPGRADECRITERIA -removed,-count[avoid-version,changed],-count[version-lag,request],-count[version-lag,changed],-count[missing-depexts,changed],-changed)

/home/opam: (run (shell "opam pin add -k version -yn conf-pkg-config.1.1 1.1"))
conf-pkg-config is now pinned to version 1.1
2024-02-12 20:05.29 ---> using "efd69474de39398f08b803f28b1c0635d272139b0c33f4b0a322013c52989663" from cache

/home/opam: (run (cache (opam-archives (target /home/opam/.opam/download-cache)))
                 (network host)
                 (shell  "opam reinstall conf-pkg-config.1.1;\
                        \n        res=$?;\
                        \n        test \"$res\" != 31 && exit \"$res\";\
                        \n        export OPAMCLI=2.0;\
                        \n        build_dir=$(opam var prefix)/.opam-switch/build;\
                        \n        failed=$(ls \"$build_dir\");\
                        \n        partial_fails=\"\";\
                        \n        for pkg in $failed; do\
                        \n          if opam show -f x-ci-accept-failures: \"$pkg\" | grep -qF \"\\\"debian-12\\\"\"; then\
                        \n            echo \"A package failed and has been disabled for CI using the 'x-ci-accept-failures' field.\";\
                        \n          fi;\
                        \n          test \"$pkg\" != 'conf-pkg-config.1.1' && partial_fails=\"$partial_fails $pkg\";\
                        \n        done;\
                        \n        test \"${partial_fails}\" != \"\" && echo \"opam-repo-ci detected dependencies failing: ${partial_fails}\";\
                        \n        exit 1"))
conf-pkg-config.1.1 is not installed. Install it? [y/n] y
The following actions will be performed:
=== install 1 package
  - install conf-pkg-config 1.1 (pinned)

The following system packages will first need to be installed:
    pkg-config

<><> Handling external dependencies <><><><><><><><><><><><><><><><><><><><><><>

opam believes some required external dependencies are missing. opam can:
> 1. Run apt-get to install them (may need root/sudo access)
  2. Display the recommended apt-get command and wait while you run it manually (e.g. in another terminal)
  3. Continue anyway, and, upon success, permanently register that this external dependency is present, but not detectable
  4. Abort the installation

[1/2/3/4] 1

+ /usr/bin/sudo "apt-get" "install" "-qq" "-yy" "pkg-config"
- debconf: delaying package configuration, since apt-utils is not installed
- Selecting previously unselected package libpkgconf3:amd64.
- (Reading database ... 
(Reading database ... 5%
(Reading database ... 10%
(Reading database ... 15%
(Reading database ... 20%
(Reading database ... 25%
(Reading database ... 30%
(Reading database ... 35%
(Reading database ... 40%
(Reading database ... 45%
(Reading database ... 50%
(Reading database ... 55%
(Reading database ... 60%
(Reading database ... 65%
(Reading database ... 70%
(Reading database ... 75%
(Reading database ... 80%
(Reading database ... 85%
(Reading database ... 90%
(Reading database ... 95%
(Reading database ... 100%
(Reading database ... 18774 files and directories currently installed.)
- Preparing to unpack .../libpkgconf3_1.8.1-1_amd64.deb ...
- Unpacking libpkgconf3:amd64 (1.8.1-1) ...
- Selecting previously unselected package pkgconf-bin.
- Preparing to unpack .../pkgconf-bin_1.8.1-1_amd64.deb ...
- Unpacking pkgconf-bin (1.8.1-1) ...
- Selecting previously unselected package pkgconf:amd64.
- Preparing to unpack .../pkgconf_1.8.1-1_amd64.deb ...
- Unpacking pkgconf:amd64 (1.8.1-1) ...
- Selecting previously unselected package pkg-config:amd64.
- Preparing to unpack .../pkg-config_1.8.1-1_amd64.deb ...
- Unpacking pkg-config:amd64 (1.8.1-1) ...
- Setting up libpkgconf3:amd64 (1.8.1-1) ...
- Setting up pkgconf-bin (1.8.1-1) ...
- Setting up pkgconf:amd64 (1.8.1-1) ...
- Setting up pkg-config:amd64 (1.8.1-1) ...
- Processing triggers for libc-bin (2.36-9+deb12u4) ...

<><> Processing actions <><><><><><><><><><><><><><><><><><><><><><><><><><><><>
-> installed conf-pkg-config.1.1
Done.
# Run eval $(opam env) to update the current shell environment
2024-02-12 20:05.29 ---> using "0686843ae3c31f38ac5563a3bcd57d9eed648c8dbf66daffdc86057dfb09ccb3" from cache

/home/opam: (env OPAMCRITERIA -removed,-count[avoid-version,changed],-count[version-lag,request],-count[version-lag,changed],-count[missing-depexts,changed],-changed)

/home/opam: (env OPAMFIXUPCRITERIA -removed,-count[avoid-version,changed],-count[version-lag,request],-count[version-lag,changed],-count[missing-depexts,changed],-changed)

/home/opam: (env OPAMUPGRADECRITERIA -removed,-count[avoid-version,changed],-count[version-lag,request],-count[version-lag,changed],-count[missing-depexts,changed],-changed)

/home/opam: (run (cache (opam-archives (target /home/opam/.opam/download-cache)))
                 (network host)
                 (shell  "opam reinstall systemverilog.0.0.1;\
                        \n        res=$?;\
                        \n        test \"$res\" != 31 && exit \"$res\";\
                        \n        export OPAMCLI=2.0;\
                        \n        build_dir=$(opam var prefix)/.opam-switch/build;\
                        \n        failed=$(ls \"$build_dir\");\
                        \n        partial_fails=\"\";\
                        \n        for pkg in $failed; do\
                        \n          if opam show -f x-ci-accept-failures: \"$pkg\" | grep -qF \"\\\"debian-12\\\"\"; then\
                        \n            echo \"A package failed and has been disabled for CI using the 'x-ci-accept-failures' field.\";\
                        \n          fi;\
                        \n          test \"$pkg\" != 'systemverilog.0.0.1' && partial_fails=\"$partial_fails $pkg\";\
                        \n        done;\
                        \n        test \"${partial_fails}\" != \"\" && echo \"opam-repo-ci detected dependencies failing: ${partial_fails}\";\
                        \n        exit 1"))
systemverilog.0.0.1 is not installed. Install it? [y/n] y
The following actions will be performed:
=== install 15 packages
  - install astring             0.8.5    [required by systemverilog]
  - install dune                3.13.1   [required by menhir, ppx_import]
  - install menhir              20200211 [required by systemverilog]
  - install menhirLib           20200211 [required by menhir]
  - install menhirSdk           20200211 [required by menhir]
  - install ocaml-compiler-libs v0.12.4  [required by ppxlib]
  - install ocamlbuild          0.14.3   [required by systemverilog]
  - install ocamlfind           1.9.6    [required by systemverilog]
  - install ppx_derivers        1.2.1    [required by ppxlib]
  - install ppx_import          1.10.0   [required by systemverilog]
  - install ppxlib              0.32.0   [required by ppx_import]
  - install sexplib0            v0.16.0  [required by ppxlib]
  - install stdlib-shims        0.3.0    [required by ppxlib]
  - install systemverilog       0.0.1
  - install topkg               1.0.7    [required by systemverilog]

<><> Processing actions <><><><><><><><><><><><><><><><><><><><><><><><><><><><>
-> retrieved astring.0.8.5  (cached)
-> retrieved dune.3.13.1  (cached)
-> retrieved menhir.20200211, menhirLib.20200211, menhirSdk.20200211  (cached)
-> retrieved ocaml-compiler-libs.v0.12.4  (cached)
-> retrieved ocamlbuild.0.14.3  (cached)
-> retrieved ocamlfind.1.9.6  (cached)
-> retrieved ppx_derivers.1.2.1  (cached)
-> retrieved ppx_import.1.10.0  (cached)
-> retrieved ppxlib.0.32.0  (cached)
-> retrieved sexplib0.v0.16.0  (cached)
-> retrieved stdlib-shims.0.3.0  (cached)
-> retrieved systemverilog.0.0.1  (cached)
-> retrieved topkg.1.0.7  (cached)
-> installed ocamlfind.1.9.6
-> installed ocamlbuild.0.14.3
-> installed topkg.1.0.7
-> installed astring.0.8.5
-> installed dune.3.13.1
-> installed ppx_derivers.1.2.1
-> installed stdlib-shims.0.3.0
-> installed menhirSdk.20200211
-> installed menhirLib.20200211
-> installed sexplib0.v0.16.0
-> installed ocaml-compiler-libs.v0.12.4
-> installed menhir.20200211
-> installed ppxlib.0.32.0
-> installed ppx_import.1.10.0
[ERROR] The compilation of systemverilog.0.0.1 failed at "ocaml pkg/pkg.ml build --dev-pkg false".

#=== ERROR while compiling systemverilog.0.0.1 ================================#
# context              2.2.0~beta2~dev | linux/x86_64 | ocaml-base-compiler.5.1.1 | file:///home/opam/opam-repository
# path                 ~/.opam/5.1/.opam-switch/build/systemverilog.0.0.1
# command              ~/.opam/opam-init/hooks/sandbox.sh build ocaml pkg/pkg.ml build --dev-pkg false
# exit-code            1
# env-file             ~/.opam/log/systemverilog-7-602241.env
# output-file          ~/.opam/log/systemverilog-7-602241.out
### output ###
# ocamlfind ocamlopt unix.cmxa -I /home/opam/.opam/5.1/lib/ocamlbuild /home/opam/.opam/5.1/lib/ocamlbuild/ocamlbuildlib.cmxa -linkpkg myocamlbuild.ml /home/opam/.opam/5.1/lib/ocamlbuild/ocamlbuild.cmx -o myocamlbuild
# ocamlfind ocamldep -modules src/grammar.mli > src/grammar.mli.depends
# ocamlfind ocamlc -c -g -bin-annot -safe-string -I src -o src/grammar.cmi src/grammar.mli
# ocamlfind ocamldep -package ppx_import -modules src/grammar.ml > src/grammar.ml.depends
# ocamlfind ocamldep -modules src/lexer.mli > src/lexer.mli.depends
# menhir --raw-depend --ocamldep 'ocamlfind ocamldep -modules' src/parser.mly > src/parser.mly.depends
# menhir --ocamlc 'ocamlfind ocamlc -g -bin-annot -safe-string -w -40 -package ppx_import -I src' --infer src/parser.mly
# ocamlfind ocamldep -modules src/parser.mli > src/parser.mli.depends
# ocamlfind ocamlc -c -g -bin-annot -safe-string -I src -o src/parser.cmi src/parser.mli
# ocamlfind ocamlc -c -g -bin-annot -safe-string -I src -o src/lexer.cmi src/lexer.mli
# /home/opam/.opam/5.1/bin/ocamllex.opt -q src/lexer.mll
# ocamlfind ocamldep -package ppx_import -modules src/lexer.ml > src/lexer.ml.depends
# ocamlfind ocamldep -package ppx_import -modules src/parser.ml > src/parser.ml.depends
# ocamlfind ocamlc -c -g -bin-annot -safe-string -package ppx_import -I src -o src/grammar.cmo src/grammar.ml
# ocamlfind ocamlc -c -g -bin-annot -safe-string -package ppx_import -I src -o src/lexer.cmo src/lexer.ml
# ocamlfind ocamlc -c -g -bin-annot -safe-string -w -40 -package ppx_import -I src -o src/parser.cmo src/parser.ml
# ocamlfind ocamlc -pack -g -bin-annot src/grammar.cmo src/parser.cmo src/lexer.cmo -o src/SystemVerilog.cmo
# ocamlfind ocamlopt -c -g -bin-annot -safe-string -for-pack SystemVerilog -package ppx_import -I src -o src/grammar.cmx src/grammar.ml
# ocamlfind ocamlopt -c -g -bin-annot -safe-string -for-pack SystemVerilog -w -40 -package ppx_import -I src -o src/parser.cmx src/parser.ml
# ocamlfind ocamlopt -c -g -bin-annot -safe-string -for-pack SystemVerilog -package ppx_import -I src -o src/lexer.cmx src/lexer.ml
# touch src/SystemVerilog.mli  ; if  ocamlfind ocamlopt -pack -g -bin-annot -I src src/grammar.cmx src/parser.cmx src/lexer.cmx -o src/SystemVerilog.cmx  ; then  rm -f src/SystemVerilog.mli  ; else  rm -f src/SystemVerilog.mli  ; exit 1; fi
# ocamlfind ocamlopt -a -I src src/SystemVerilog.cmx -o src/SystemVerilog.cmxa
# ocamlfind ocamlopt -shared -linkall -I src src/SystemVerilog.cmxa -o src/SystemVerilog.cmxs
# ocamlfind ocamlc -a -I src src/SystemVerilog.cmo -o src/SystemVerilog.cma
# ocamlfind ocamldep -modules tools/sv_parse.ml > tools/sv_parse.ml.depends
# ocamlfind ocamlc -c -g -bin-annot -safe-string -I tools -I src -o tools/sv_parse.cmo tools/sv_parse.ml
# + ocamlfind ocamlc -c -g -bin-annot -safe-string -I tools -I src -o tools/sv_parse.cmo tools/sv_parse.ml
# File "_none_", line 1:
# Alert ocaml_deprecated_auto_include: 
# OCaml's lib directory layout changed in 5.0. The unix subdirectory has been
# automatically added to the search path, but you should add -I +unix to the
# command-line to silence this alert (e.g. by adding unix to the list of
# libraries in your dune file, or adding use_unix to your _tags file for
# ocamlbuild, or using -package unix for ocamlfind).
# ocamlfind ocamlopt -c -g -bin-annot -safe-string -I tools -I src -o tools/sv_parse.cmx tools/sv_parse.ml
# + ocamlfind ocamlopt -c -g -bin-annot -safe-string -I tools -I src -o tools/sv_parse.cmx tools/sv_parse.ml
# File "_none_", line 1:
# Alert ocaml_deprecated_auto_include: 
# OCaml's lib directory layout changed in 5.0. The unix subdirectory has been
# automatically added to the search path, but you should add -I +unix to the
# command-line to silence this alert (e.g. by adding unix to the list of
# libraries in your dune file, or adding use_unix to your _tags file for
# ocamlbuild, or using -package unix for ocamlfind).
# 
# File "tools/sv_parse.ml", line 1:
# Error: src/grammar.cmx was built with -for-pack SystemVerilog, but the 
#        current unit Sv_parse is not
# Command exited with code 2.
# + ocamlfind ocamlopt unix.cmxa -I /home/opam/.opam/5.1/lib/ocamlbuild /home/opam/.opam/5.1/lib/ocamlbuild/ocamlbuildlib.cmxa -linkpkg myocamlbuild.ml /home/opam/.opam/5.1/lib/ocamlbuild/ocamlbuild.cmx -o myocamlbuild
# File "_none_", line 1:
# Alert ocaml_deprecated_auto_include: 
# OCaml's lib directory layout changed in 5.0. The unix subdirectory has been
# automatically added to the search path, but you should add -I +unix to the
# command-line to silence this alert (e.g. by adding unix to the list of
# libraries in your dune file, or adding use_unix to your _tags file for
# ocamlbuild, or using -package unix for ocamlfind).
# pkg.ml: [ERROR] cmd ['ocamlbuild' '-use-ocamlfind' '-classic-display' '-j' '4' '-tag' 'debug'
#      '-build-dir' '_build' 'opam' 'pkg/META' 'CHANGES.md' 'LICENSE.md'
#      'README.md' 'src/SystemVerilog.cmxs' 'src/SystemVerilog.cmxa'
#      'src/SystemVerilog.cmx' 'src/SystemVerilog.cma' 'src/SystemVerilog.cmi'
#      'src/SystemVerilog.a' 'src/parser.mli' 'src/lexer.mli' 'src/grammar.mli'
#      'tools/sv_parse.native']: exited with 10



<><> Error report <><><><><><><><><><><><><><><><><><><><><><><><><><><><><><><>
+- The following actions failed
| - build systemverilog 0.0.1
+- 
+- The following changes have been performed
| - install astring             0.8.5
| - install dune                3.13.1
| - install menhir              20200211
| - install menhirLib           20200211
| - install menhirSdk           20200211
| - install ocaml-compiler-libs v0.12.4
| - install ocamlbuild          0.14.3
| - install ocamlfind           1.9.6
| - install ppx_derivers        1.2.1
| - install ppx_import          1.10.0
| - install ppxlib              0.32.0
| - install sexplib0            v0.16.0
| - install stdlib-shims        0.3.0
| - install topkg               1.0.7
+- 
# Run eval $(opam env) to update the current shell environment

The former state can be restored with:
    /usr/bin/opam switch import "/home/opam/.opam/5.1/.opam-switch/backup/state-20240212200530.export"
[WARNING] OPAMCONFIRMLEVEL was ignored because CLI 2.0 was requested and it was introduced in 2.1.
[WARNING] OPAMCONFIRMLEVEL was ignored because CLI 2.0 was requested and it was introduced in 2.1.
"/usr/bin/env" "bash" "-c" "opam reinstall systemverilog.0.0.1;
        res=$?;
        test "$res" != 31 && exit "$res";
        export OPAMCLI=2.0;
        build_dir=$(opam var prefix)/.opam-switch/build;
        failed=$(ls "$build_dir");
        partial_fails="";
        for pkg in $failed; do
          if opam show -f x-ci-accept-failures: "$pkg" | grep -qF "\"debian-12\""; then
            echo "A package failed and has been disabled for CI using the 'x-ci-accept-failures' field.";
          fi;
          test "$pkg" != 'systemverilog.0.0.1' && partial_fails="$partial_fails $pkg";
        done;
        test "${partial_fails}" != "" && echo "opam-repo-ci detected dependencies failing: ${partial_fails}";
        exit 1" failed with exit status 1
2024-02-12 20:06.17: Job failed: Failed: Build failed
2024-02-12 20:06.17: Log analysis:
2024-02-12 20:06.17: >>> 
[ERROR] The compilation of systemverilog.0.0.1 failed at "ocaml pkg/pkg.ml build --dev-pkg false".
 (score = 20)
2024-02-12 20:06.17: >>> 
# Error: src/grammar.cmx was built with -for-pack SystemVerilog, but the 
 (score = 48)
2024-02-12 20:06.17: src/grammar.cmx was built with -for-pack SystemVerilog, but the