Build:
  1. 0
2024-02-11 20:23.53: New job: test spectrum.0.1.0 with conf-pkg-config.1.1, using opam dev
                              from https://github.com/ocaml/opam-repository.git#refs/pull/25235/head (8c7391d6ec81e93f24de221eb32a886b72d1ede6)
                              on debian-12-ocaml-5.1/amd64

To reproduce locally:

cd $(mktemp -d)
git clone --recursive "https://github.com/ocaml/opam-repository.git" && cd "opam-repository" && git fetch origin "refs/pull/25235/head" && git reset --hard 8c7391d6
git fetch origin master
git merge --no-edit 8477e9a74beb40d85534ab7653b65d45607a147f
cat > ../Dockerfile <<'END-OF-DOCKERFILE'
FROM ocaml/opam:debian-12-ocaml-5.1@sha256:931805f2c2fdb0b5642ae8463ff0780c2ee3f4afb48734a7d94e2d5163429930
USER 1000:1000
WORKDIR /home/opam
RUN sudo ln -f /usr/bin/opam-dev /usr/bin/opam
RUN opam init --reinit -ni
ENV OPAMDOWNLOADJOBS="1"
ENV OPAMERRLOGLEN="0"
ENV OPAMSOLVERTIMEOUT="500"
ENV OPAMPRECISETRACKING="1"
ENV CI="true"
ENV OPAM_REPO_CI="true"
RUN rm -rf opam-repository/
COPY --chown=1000:1000 . opam-repository/
RUN opam repository set-url --strict default opam-repository/
RUN opam update --depexts || true
ENV OPAMCRITERIA="-removed,-count[avoid-version,changed],-count[version-lag,request],-count[version-lag,changed],-count[missing-depexts,changed],-changed"
ENV OPAMFIXUPCRITERIA="-removed,-count[avoid-version,changed],-count[version-lag,request],-count[version-lag,changed],-count[missing-depexts,changed],-changed"
ENV OPAMUPGRADECRITERIA="-removed,-count[avoid-version,changed],-count[version-lag,request],-count[version-lag,changed],-count[missing-depexts,changed],-changed"
RUN opam pin add -k version -yn conf-pkg-config.1.1 1.1
RUN opam reinstall conf-pkg-config.1.1; \
    res=$?; \
    test "$res" != 31 && exit "$res"; \
    export OPAMCLI=2.0; \
    build_dir=$(opam var prefix)/.opam-switch/build; \
    failed=$(ls "$build_dir"); \
    partial_fails=""; \
    for pkg in $failed; do \
    if opam show -f x-ci-accept-failures: "$pkg" | grep -qF "\"debian-12\""; then \
    echo "A package failed and has been disabled for CI using the 'x-ci-accept-failures' field."; \
    fi; \
    test "$pkg" != 'conf-pkg-config.1.1' && partial_fails="$partial_fails $pkg"; \
    done; \
    test "${partial_fails}" != "" && echo "opam-repo-ci detected dependencies failing: ${partial_fails}"; \
    exit 1
ENV OPAMCRITERIA="-removed,-count[avoid-version,changed],-count[version-lag,request],-count[version-lag,changed],-count[missing-depexts,changed],-changed"
ENV OPAMFIXUPCRITERIA="-removed,-count[avoid-version,changed],-count[version-lag,request],-count[version-lag,changed],-count[missing-depexts,changed],-changed"
ENV OPAMUPGRADECRITERIA="-removed,-count[avoid-version,changed],-count[version-lag,request],-count[version-lag,changed],-count[missing-depexts,changed],-changed"
RUN opam reinstall spectrum.0.1.0; \
    res=$?; \
    test "$res" != 31 && exit "$res"; \
    export OPAMCLI=2.0; \
    build_dir=$(opam var prefix)/.opam-switch/build; \
    failed=$(ls "$build_dir"); \
    partial_fails=""; \
    for pkg in $failed; do \
    if opam show -f x-ci-accept-failures: "$pkg" | grep -qF "\"debian-12\""; then \
    echo "A package failed and has been disabled for CI using the 'x-ci-accept-failures' field."; \
    fi; \
    test "$pkg" != 'spectrum.0.1.0' && partial_fails="$partial_fails $pkg"; \
    done; \
    test "${partial_fails}" != "" && echo "opam-repo-ci detected dependencies failing: ${partial_fails}"; \
    exit 1
ENV OPAMCRITERIA="-removed,-count[avoid-version,changed],-count[version-lag,request],-count[version-lag,changed],-count[missing-depexts,changed],-changed"
ENV OPAMFIXUPCRITERIA="-removed,-count[avoid-version,changed],-count[version-lag,request],-count[version-lag,changed],-count[missing-depexts,changed],-changed"
ENV OPAMUPGRADECRITERIA="-removed,-count[avoid-version,changed],-count[version-lag,request],-count[version-lag,changed],-count[missing-depexts,changed],-changed"
RUN (opam reinstall --with-test spectrum.0.1.0) || true
RUN opam reinstall --with-test --verbose spectrum.0.1.0; \
    res=$?; \
    test "$res" != 31 && exit "$res"; \
    export OPAMCLI=2.0; \
    build_dir=$(opam var prefix)/.opam-switch/build; \
    failed=$(ls "$build_dir"); \
    partial_fails=""; \
    for pkg in $failed; do \
    if opam show -f x-ci-accept-failures: "$pkg" | grep -qF "\"debian-12\""; then \
    echo "A package failed and has been disabled for CI using the 'x-ci-accept-failures' field."; \
    fi; \
    test "$pkg" != 'spectrum.0.1.0' && partial_fails="$partial_fails $pkg"; \
    done; \
    test "${partial_fails}" != "" && echo "opam-repo-ci detected dependencies failing: ${partial_fails}"; \
    exit 1

END-OF-DOCKERFILE
docker build -f ../Dockerfile .

2024-02-11 20:23.53: Using cache hint "ocaml/opam:debian-12-ocaml-5.1@sha256:931805f2c2fdb0b5642ae8463ff0780c2ee3f4afb48734a7d94e2d5163429930-conf-pkg-config.1.1-spectrum.0.1.0-8c7391d6ec81e93f24de221eb32a886b72d1ede6"
2024-02-11 20:23.53: Using OBuilder spec:
((from ocaml/opam:debian-12-ocaml-5.1@sha256:931805f2c2fdb0b5642ae8463ff0780c2ee3f4afb48734a7d94e2d5163429930)
 (user (uid 1000) (gid 1000))
 (workdir /home/opam)
 (run (shell "sudo ln -f /usr/bin/opam-dev /usr/bin/opam"))
 (run (network host)
      (shell "opam init --reinit --config .opamrc-sandbox -ni"))
 (env OPAMDOWNLOADJOBS 1)
 (env OPAMERRLOGLEN 0)
 (env OPAMSOLVERTIMEOUT 500)
 (env OPAMPRECISETRACKING 1)
 (env CI true)
 (env OPAM_REPO_CI true)
 (run (shell "rm -rf opam-repository/"))
 (copy (src .) (dst opam-repository/))
 (run (shell "opam repository set-url --strict default opam-repository/"))
 (run (network host)
      (shell "opam update --depexts || true"))
 (env OPAMCRITERIA -removed,-count[avoid-version,changed],-count[version-lag,request],-count[version-lag,changed],-count[missing-depexts,changed],-changed)
 (env OPAMFIXUPCRITERIA -removed,-count[avoid-version,changed],-count[version-lag,request],-count[version-lag,changed],-count[missing-depexts,changed],-changed)
 (env OPAMUPGRADECRITERIA -removed,-count[avoid-version,changed],-count[version-lag,request],-count[version-lag,changed],-count[missing-depexts,changed],-changed)
 (run (shell "opam pin add -k version -yn conf-pkg-config.1.1 1.1"))
 (run (cache (opam-archives (target /home/opam/.opam/download-cache)))
      (network host)
      (shell  "opam reinstall conf-pkg-config.1.1;\
             \n        res=$?;\
             \n        test \"$res\" != 31 && exit \"$res\";\
             \n        export OPAMCLI=2.0;\
             \n        build_dir=$(opam var prefix)/.opam-switch/build;\
             \n        failed=$(ls \"$build_dir\");\
             \n        partial_fails=\"\";\
             \n        for pkg in $failed; do\
             \n          if opam show -f x-ci-accept-failures: \"$pkg\" | grep -qF \"\\\"debian-12\\\"\"; then\
             \n            echo \"A package failed and has been disabled for CI using the 'x-ci-accept-failures' field.\";\
             \n          fi;\
             \n          test \"$pkg\" != 'conf-pkg-config.1.1' && partial_fails=\"$partial_fails $pkg\";\
             \n        done;\
             \n        test \"${partial_fails}\" != \"\" && echo \"opam-repo-ci detected dependencies failing: ${partial_fails}\";\
             \n        exit 1"))
 (env OPAMCRITERIA -removed,-count[avoid-version,changed],-count[version-lag,request],-count[version-lag,changed],-count[missing-depexts,changed],-changed)
 (env OPAMFIXUPCRITERIA -removed,-count[avoid-version,changed],-count[version-lag,request],-count[version-lag,changed],-count[missing-depexts,changed],-changed)
 (env OPAMUPGRADECRITERIA -removed,-count[avoid-version,changed],-count[version-lag,request],-count[version-lag,changed],-count[missing-depexts,changed],-changed)
 (run (cache (opam-archives (target /home/opam/.opam/download-cache)))
      (network host)
      (shell  "opam reinstall spectrum.0.1.0;\
             \n        res=$?;\
             \n        test \"$res\" != 31 && exit \"$res\";\
             \n        export OPAMCLI=2.0;\
             \n        build_dir=$(opam var prefix)/.opam-switch/build;\
             \n        failed=$(ls \"$build_dir\");\
             \n        partial_fails=\"\";\
             \n        for pkg in $failed; do\
             \n          if opam show -f x-ci-accept-failures: \"$pkg\" | grep -qF \"\\\"debian-12\\\"\"; then\
             \n            echo \"A package failed and has been disabled for CI using the 'x-ci-accept-failures' field.\";\
             \n          fi;\
             \n          test \"$pkg\" != 'spectrum.0.1.0' && partial_fails=\"$partial_fails $pkg\";\
             \n        done;\
             \n        test \"${partial_fails}\" != \"\" && echo \"opam-repo-ci detected dependencies failing: ${partial_fails}\";\
             \n        exit 1"))
 (env OPAMCRITERIA -removed,-count[avoid-version,changed],-count[version-lag,request],-count[version-lag,changed],-count[missing-depexts,changed],-changed)
 (env OPAMFIXUPCRITERIA -removed,-count[avoid-version,changed],-count[version-lag,request],-count[version-lag,changed],-count[missing-depexts,changed],-changed)
 (env OPAMUPGRADECRITERIA -removed,-count[avoid-version,changed],-count[version-lag,request],-count[version-lag,changed],-count[missing-depexts,changed],-changed)
 (run (network host)
      (shell "(opam reinstall --with-test spectrum.0.1.0) || true"))
 (run (shell  "opam reinstall --with-test --verbose spectrum.0.1.0;\
             \n        res=$?;\
             \n        test \"$res\" != 31 && exit \"$res\";\
             \n        export OPAMCLI=2.0;\
             \n        build_dir=$(opam var prefix)/.opam-switch/build;\
             \n        failed=$(ls \"$build_dir\");\
             \n        partial_fails=\"\";\
             \n        for pkg in $failed; do\
             \n          if opam show -f x-ci-accept-failures: \"$pkg\" | grep -qF \"\\\"debian-12\\\"\"; then\
             \n            echo \"A package failed and has been disabled for CI using the 'x-ci-accept-failures' field.\";\
             \n          fi;\
             \n          test \"$pkg\" != 'spectrum.0.1.0' && partial_fails=\"$partial_fails $pkg\";\
             \n        done;\
             \n        test \"${partial_fails}\" != \"\" && echo \"opam-repo-ci detected dependencies failing: ${partial_fails}\";\
             \n        exit 1"))
)

2024-02-11 20:23.53: Waiting for resource in pool OCluster
2024-02-12 20:04.57: Waiting for worker…
2024-02-12 20:06.19: Got resource from pool OCluster
Building on asteria.caelum.ci.dev
All commits already cached
HEAD is now at 8477e9a74b Merge pull request #25221 from nberth/mlgmpidl-1.3.0
Updating 8477e9a74b..8c7391d6ec
Fast-forward
 packages/conf-pkg-config/conf-pkg-config.1.0/opam | 2 +-
 packages/conf-pkg-config/conf-pkg-config.1.1/opam | 1 +
 packages/conf-pkg-config/conf-pkg-config.1.2/opam | 1 +
 packages/conf-pkg-config/conf-pkg-config.1.3/opam | 1 +
 packages/conf-pkg-config/conf-pkg-config.2/opam   | 1 +
 packages/conf-pkg-config/conf-pkg-config.3/opam   | 4 +++-
 6 files changed, 8 insertions(+), 2 deletions(-)

(from ocaml/opam:debian-12-ocaml-5.1@sha256:931805f2c2fdb0b5642ae8463ff0780c2ee3f4afb48734a7d94e2d5163429930)
2024-02-12 20:07.05 ---> using "4df7ce52b8e0afe130cbfff7d9b001e43cae58bd8e8710cd073ce7c11b1c6ac8" from cache

/: (user (uid 1000) (gid 1000))

/: (workdir /home/opam)

/home/opam: (run (shell "sudo ln -f /usr/bin/opam-dev /usr/bin/opam"))
2024-02-12 20:07.05 ---> using "2ee14a5dbb7aa54ab1dfa5adba4422c5a5483941525d4174e8eeed0c4c5e97aa" from cache

/home/opam: (run (network host)
                 (shell "opam init --reinit --config .opamrc-sandbox -ni"))
Configuring from /home/opam/.opamrc-sandbox, then /home/opam/.opamrc, and finally from built-in defaults.
Checking for available remotes: rsync and local, git.
  - you won't be able to use mercurial repositories unless you install the hg command on your system.
  - you won't be able to use darcs repositories unless you install the darcs command on your system.

This development version of opam requires an update to the layout of /home/opam/.opam from version 2.0 to version 2.2~alpha, which can't be reverted.
You may want to back it up before going further.

Continue? [y/n] y
[NOTE] The 'jobs' option was reset, its value was 71 and its new value will vary according to the current number of cores on your machine. You can restore the fixed value using:
           opam option jobs=71 --global
Format upgrade done.

<><> Updating repositories ><><><><><><><><><><><><><><><><><><><><><><><><><><>
[default] synchronised from file:///home/opam/opam-repository
2024-02-12 20:07.05 ---> using "d58131e4d084860f74dbebecfc9a35ebb7fbb42cf58093b5ac6cf0adf11ed898" from cache

/home/opam: (env OPAMDOWNLOADJOBS 1)

/home/opam: (env OPAMERRLOGLEN 0)

/home/opam: (env OPAMSOLVERTIMEOUT 500)

/home/opam: (env OPAMPRECISETRACKING 1)

/home/opam: (env CI true)

/home/opam: (env OPAM_REPO_CI true)

/home/opam: (run (shell "rm -rf opam-repository/"))
2024-02-12 20:07.05 ---> using "e76676ee91f5598b65d18de047738848e5af056a75e3436903dc82ff5702c5a6" from cache

/home/opam: (copy (src .) (dst opam-repository/))
2024-02-12 20:07.06 ---> using "00dcf922e87fec2f8ccdd0b44355d41faed143c596db4bfe8812d0e9c5f33f02" from cache

/home/opam: (run (shell "opam repository set-url --strict default opam-repository/"))
[default] Initialised
2024-02-12 20:07.06 ---> using "d6c8604b98b9d01914259989eafdfad7780b6c9f761a469dfe3162a56ba73510" from cache

/home/opam: (run (network host)
                 (shell "opam update --depexts || true"))
+ /usr/bin/sudo "apt-get" "update"
- Get:1 http://deb.debian.org/debian bookworm InRelease [151 kB]
- Get:2 http://deb.debian.org/debian bookworm-updates InRelease [52.1 kB]
- Get:3 http://deb.debian.org/debian-security bookworm-security InRelease [48.0 kB]
- Get:4 http://deb.debian.org/debian bookworm/main amd64 Packages [8786 kB]
- Get:5 http://deb.debian.org/debian-security bookworm-security/main amd64 Packages [137 kB]
- Fetched 9175 kB in 1s (6830 kB/s)
- Reading package lists...
2024-02-12 20:07.06 ---> using "6245d7929b862e6b37f451133c05d21883283d0248743f67197f2e424fe52d69" from cache

/home/opam: (env OPAMCRITERIA -removed,-count[avoid-version,changed],-count[version-lag,request],-count[version-lag,changed],-count[missing-depexts,changed],-changed)

/home/opam: (env OPAMFIXUPCRITERIA -removed,-count[avoid-version,changed],-count[version-lag,request],-count[version-lag,changed],-count[missing-depexts,changed],-changed)

/home/opam: (env OPAMUPGRADECRITERIA -removed,-count[avoid-version,changed],-count[version-lag,request],-count[version-lag,changed],-count[missing-depexts,changed],-changed)

/home/opam: (run (shell "opam pin add -k version -yn conf-pkg-config.1.1 1.1"))
conf-pkg-config is now pinned to version 1.1
2024-02-12 20:07.06 ---> using "efd69474de39398f08b803f28b1c0635d272139b0c33f4b0a322013c52989663" from cache

/home/opam: (run (cache (opam-archives (target /home/opam/.opam/download-cache)))
                 (network host)
                 (shell  "opam reinstall conf-pkg-config.1.1;\
                        \n        res=$?;\
                        \n        test \"$res\" != 31 && exit \"$res\";\
                        \n        export OPAMCLI=2.0;\
                        \n        build_dir=$(opam var prefix)/.opam-switch/build;\
                        \n        failed=$(ls \"$build_dir\");\
                        \n        partial_fails=\"\";\
                        \n        for pkg in $failed; do\
                        \n          if opam show -f x-ci-accept-failures: \"$pkg\" | grep -qF \"\\\"debian-12\\\"\"; then\
                        \n            echo \"A package failed and has been disabled for CI using the 'x-ci-accept-failures' field.\";\
                        \n          fi;\
                        \n          test \"$pkg\" != 'conf-pkg-config.1.1' && partial_fails=\"$partial_fails $pkg\";\
                        \n        done;\
                        \n        test \"${partial_fails}\" != \"\" && echo \"opam-repo-ci detected dependencies failing: ${partial_fails}\";\
                        \n        exit 1"))
conf-pkg-config.1.1 is not installed. Install it? [y/n] y
The following actions will be performed:
=== install 1 package
  - install conf-pkg-config 1.1 (pinned)

The following system packages will first need to be installed:
    pkg-config

<><> Handling external dependencies <><><><><><><><><><><><><><><><><><><><><><>

opam believes some required external dependencies are missing. opam can:
> 1. Run apt-get to install them (may need root/sudo access)
  2. Display the recommended apt-get command and wait while you run it manually (e.g. in another terminal)
  3. Continue anyway, and, upon success, permanently register that this external dependency is present, but not detectable
  4. Abort the installation

[1/2/3/4] 1

+ /usr/bin/sudo "apt-get" "install" "-qq" "-yy" "pkg-config"
- debconf: delaying package configuration, since apt-utils is not installed
- Selecting previously unselected package libpkgconf3:amd64.
- (Reading database ... 
(Reading database ... 5%
(Reading database ... 10%
(Reading database ... 15%
(Reading database ... 20%
(Reading database ... 25%
(Reading database ... 30%
(Reading database ... 35%
(Reading database ... 40%
(Reading database ... 45%
(Reading database ... 50%
(Reading database ... 55%
(Reading database ... 60%
(Reading database ... 65%
(Reading database ... 70%
(Reading database ... 75%
(Reading database ... 80%
(Reading database ... 85%
(Reading database ... 90%
(Reading database ... 95%
(Reading database ... 100%
(Reading database ... 18774 files and directories currently installed.)
- Preparing to unpack .../libpkgconf3_1.8.1-1_amd64.deb ...
- Unpacking libpkgconf3:amd64 (1.8.1-1) ...
- Selecting previously unselected package pkgconf-bin.
- Preparing to unpack .../pkgconf-bin_1.8.1-1_amd64.deb ...
- Unpacking pkgconf-bin (1.8.1-1) ...
- Selecting previously unselected package pkgconf:amd64.
- Preparing to unpack .../pkgconf_1.8.1-1_amd64.deb ...
- Unpacking pkgconf:amd64 (1.8.1-1) ...
- Selecting previously unselected package pkg-config:amd64.
- Preparing to unpack .../pkg-config_1.8.1-1_amd64.deb ...
- Unpacking pkg-config:amd64 (1.8.1-1) ...
- Setting up libpkgconf3:amd64 (1.8.1-1) ...
- Setting up pkgconf-bin (1.8.1-1) ...
- Setting up pkgconf:amd64 (1.8.1-1) ...
- Setting up pkg-config:amd64 (1.8.1-1) ...
- Processing triggers for libc-bin (2.36-9+deb12u4) ...

<><> Processing actions <><><><><><><><><><><><><><><><><><><><><><><><><><><><>
-> installed conf-pkg-config.1.1
Done.
# Run eval $(opam env) to update the current shell environment
2024-02-12 20:07.06 ---> using "0686843ae3c31f38ac5563a3bcd57d9eed648c8dbf66daffdc86057dfb09ccb3" from cache

/home/opam: (env OPAMCRITERIA -removed,-count[avoid-version,changed],-count[version-lag,request],-count[version-lag,changed],-count[missing-depexts,changed],-changed)

/home/opam: (env OPAMFIXUPCRITERIA -removed,-count[avoid-version,changed],-count[version-lag,request],-count[version-lag,changed],-count[missing-depexts,changed],-changed)

/home/opam: (env OPAMUPGRADECRITERIA -removed,-count[avoid-version,changed],-count[version-lag,request],-count[version-lag,changed],-count[missing-depexts,changed],-changed)

/home/opam: (run (cache (opam-archives (target /home/opam/.opam/download-cache)))
                 (network host)
                 (shell  "opam reinstall spectrum.0.1.0;\
                        \n        res=$?;\
                        \n        test \"$res\" != 31 && exit \"$res\";\
                        \n        export OPAMCLI=2.0;\
                        \n        build_dir=$(opam var prefix)/.opam-switch/build;\
                        \n        failed=$(ls \"$build_dir\");\
                        \n        partial_fails=\"\";\
                        \n        for pkg in $failed; do\
                        \n          if opam show -f x-ci-accept-failures: \"$pkg\" | grep -qF \"\\\"debian-12\\\"\"; then\
                        \n            echo \"A package failed and has been disabled for CI using the 'x-ci-accept-failures' field.\";\
                        \n          fi;\
                        \n          test \"$pkg\" != 'spectrum.0.1.0' && partial_fails=\"$partial_fails $pkg\";\
                        \n        done;\
                        \n        test \"${partial_fails}\" != \"\" && echo \"opam-repo-ci detected dependencies failing: ${partial_fails}\";\
                        \n        exit 1"))
spectrum.0.1.0 is not installed. Install it? [y/n] y
The following actions will be performed:
=== install 7 packages
  - install color      0.2.0  [required by spectrum]
  - install dune       3.13.1 [required by spectrum]
  - install gg         1.0.0  [required by color]
  - install ocamlbuild 0.14.3 [required by gg]
  - install ocamlfind  1.9.6  [required by gg]
  - install spectrum   0.1.0
  - install topkg      1.0.7  [required by gg]

<><> Processing actions <><><><><><><><><><><><><><><><><><><><><><><><><><><><>
-> retrieved color.0.2.0  (cached)
-> retrieved dune.3.13.1  (cached)
-> retrieved gg.1.0.0  (cached)
-> retrieved ocamlbuild.0.14.3  (cached)
-> retrieved ocamlfind.1.9.6  (cached)
-> retrieved spectrum.0.1.0  (cached)
-> retrieved topkg.1.0.7  (cached)
-> installed ocamlfind.1.9.6
-> installed ocamlbuild.0.14.3
-> installed topkg.1.0.7
-> installed gg.1.0.0
-> installed dune.3.13.1
-> installed color.0.2.0
-> installed spectrum.0.1.0
Done.
# Run eval $(opam env) to update the current shell environment
2024-02-12 20:07.32 ---> saved as "24588421a08d8251446e44b9337fedd8766247a290e80a8d3fb0a2fe43457855"

/home/opam: (env OPAMCRITERIA -removed,-count[avoid-version,changed],-count[version-lag,request],-count[version-lag,changed],-count[missing-depexts,changed],-changed)

/home/opam: (env OPAMFIXUPCRITERIA -removed,-count[avoid-version,changed],-count[version-lag,request],-count[version-lag,changed],-count[missing-depexts,changed],-changed)

/home/opam: (env OPAMUPGRADECRITERIA -removed,-count[avoid-version,changed],-count[version-lag,request],-count[version-lag,changed],-count[missing-depexts,changed],-changed)

/home/opam: (run (network host)
                 (shell "(opam reinstall --with-test spectrum.0.1.0) || true"))
The following actions will be performed:
=== recompile 1 package
  - recompile spectrum       0.1.0
=== install 13 packages
  - install   alcotest       1.4.0  [required by spectrum]
  - install   astring        0.8.5  [required by alcotest]
  - install   cmdliner       1.2.0  [required by alcotest]
  - install   fmt            0.9.0  [required by alcotest]
  - install   junit          2.0.2  [required by junit_alcotest]
  - install   junit_alcotest 2.0.2  [required by spectrum]
  - install   ptime          1.1.0  [required by junit]
  - install   re             1.11.0 [required by alcotest]
  - install   seq            base   [required by re]
  - install   stdlib-shims   0.3.0  [required by alcotest]
  - install   tyxml          4.6.0  [required by junit]
  - install   uuidm          0.9.8  [required by alcotest]
  - install   uutf           1.0.3  [required by alcotest]

<><> Processing actions <><><><><><><><><><><><><><><><><><><><><><><><><><><><>
-> retrieved alcotest.1.4.0  (https://github.com/mirage/alcotest/releases/download/1.4.0/alcotest-mirage-1.4.0.tbz)
-> retrieved astring.0.8.5  (https://erratique.ch/software/astring/releases/astring-0.8.5.tbz)
-> retrieved cmdliner.1.2.0  (https://erratique.ch/software/cmdliner/releases/cmdliner-1.2.0.tbz)
-> retrieved fmt.0.9.0  (https://erratique.ch/software/fmt/releases/fmt-0.9.0.tbz)
-> retrieved junit.2.0.2, junit_alcotest.2.0.2  (https://github.com/Khady/ocaml-junit/releases/download/2.0.2/junit-2.0.2.tbz)
-> retrieved ptime.1.1.0  (https://erratique.ch/software/ptime/releases/ptime-1.1.0.tbz)
-> installed astring.0.8.5
-> retrieved re.1.11.0  (https://github.com/ocaml/ocaml-re/releases/download/1.11.0/re-1.11.0.tbz)
-> installed seq.base
-> retrieved spectrum.0.1.0  (https://github.com/anentropic/ocaml-spectrum/archive/0.1.0.tar.gz)
-> installed ptime.1.1.0
-> retrieved stdlib-shims.0.3.0  (https://github.com/ocaml/stdlib-shims/releases/download/0.3.0/stdlib-shims-0.3.0.tbz)
-> installed cmdliner.1.2.0
-> installed re.1.11.0
-> removed   spectrum.0.1.0
-> installed stdlib-shims.0.3.0
-> retrieved tyxml.4.6.0  (https://github.com/ocsigen/tyxml/releases/download/4.6.0/tyxml-4.6.0.tbz)
-> retrieved uuidm.0.9.8  (https://erratique.ch/software/uuidm/releases/uuidm-0.9.8.tbz)
-> retrieved uutf.1.0.3  (https://erratique.ch/software/uutf/releases/uutf-1.0.3.tbz)
-> installed fmt.0.9.0
-> installed uuidm.0.9.8
-> installed uutf.1.0.3
-> installed alcotest.1.4.0
-> installed tyxml.4.6.0
-> installed junit.2.0.2
-> installed junit_alcotest.2.0.2
[ERROR] The compilation of spectrum.0.1.0 failed at "dune build -p spectrum -j 255 @install @runtest".

#=== ERROR while compiling spectrum.0.1.0 =====================================#
# context              2.2.0~beta2~dev | linux/x86_64 | ocaml-base-compiler.5.1.1 | file:///home/opam/opam-repository
# path                 ~/.opam/5.1/.opam-switch/build/spectrum.0.1.0
# command              ~/.opam/opam-init/hooks/sandbox.sh build dune build -p spectrum -j 255 @install @runtest
# exit-code            1
# env-file             ~/.opam/log/spectrum-7-00f700.env
# output-file          ~/.opam/log/spectrum-7-00f700.out
### output ###
# File "tests/dune", line 2, characters 14-21:
# 2 |  (names lexer printer)
#                   ^^^^^^^
# (cd _build/default/tests && ./printer.exe)
# Testing `Printer'.
# This run has ID `D352DE3F-3E82-4970-A9E6-5A7DB50B3834'.
# 
#   [OK]          Fatal error: exception File "src/fmt.ml", line 647, characters 60-66: Assertion failed
# (cd _build/default/tests && ./lexer.exe)
# Testing `Lexer'.
# This run has ID `53095567-F300-49E8-A949-F01437F8DFA6'.
# 
#   [OK]          Styles                             0   Bold.
#   [OK]          Styles                             1   Rapid blink.
#   [OK]          Named colors                       0   Foreground (implicit):...
#   [OK]          Named colors                       1   Foreground (explicit):...
#   [OK]          Named colors                       2   Background (explicit):...
#   [OK]          Named colors                       3   Foreground (implicit):...
#   [OK]          Named colors                       4   Foreground (explicit):...
#   [OK]          Named colors                       5   Background (explicit):...
#   [OK]          Compound from named color          0   Red, Underline.
#   [OK]          Compound from named color          1   Bg Red, Underline.
#   [OK]          Compound from named color          2   dark-olive-green-1a, B...
#   [OK]          Hex colors                         0   Foreground (implicit):...
#   [OK]          Hex colors                         1   Foreground (explicit):...
#   [OK]          Hex colors                         2   Background (explicit):...
#   [OK]          Hex colors                         3   Foreground (implicit):...
#   [OK]          Hex colors                         4   Foreground (explicit):...
#   [OK]          Hex colors                         5   Background (explicit):...
#   [OK]          Hex colors                         6   Foreground (implicit):...
#   [OK]          Hex colors                         7   Foreground (explicit):...
#   [OK]          Hex colors                         8   Background (explicit):...
#   [OK]          Hex colors                         9   Foreground (implicit):...
#   [OK]          Hex colors                        10   Foreground (explicit):...
#   [OK]          Hex colors                        11   Background (explicit):...
#   [OK]          Compound from hex color            0   #F00, Underline.
#   [OK]          Compound from hex color            1   Bg #f0c090, Bold.
# 
# Full test results in `~/.opam/5.1/.opam-switch/build/spectrum.0.1.0/_build/default/tests/_build/_tests/Lexer'.
# Test Successful in 0.001s. 25 tests run.



<><> Error report <><><><><><><><><><><><><><><><><><><><><><><><><><><><><><><>
+- The following actions failed
| - build spectrum 0.1.0
+- 
+- The following changes have been performed
| - remove  spectrum       0.1.0
| - install alcotest       1.4.0
| - install astring        0.8.5
| - install cmdliner       1.2.0
| - install fmt            0.9.0
| - install junit          2.0.2
| - install junit_alcotest 2.0.2
| - install ptime          1.1.0
| - install re             1.11.0
| - install seq            base
| - install stdlib-shims   0.3.0
| - install tyxml          4.6.0
| - install uuidm          0.9.8
| - install uutf           1.0.3
+- 
# Run eval $(opam env) to update the current shell environment

The former state can be restored with:
    /usr/bin/opam switch import "/home/opam/.opam/5.1/.opam-switch/backup/state-20240212200732.export"
Or you can retry to install your package selection with:
    /usr/bin/opam install --restore
2024-02-12 20:07.51 ---> saved as "277401fe36aa82e99a939d849d53ca8340a28954fe65d5c1f64082978bb76827"

/home/opam: (run (shell  "opam reinstall --with-test --verbose spectrum.0.1.0;\
                        \n        res=$?;\
                        \n        test \"$res\" != 31 && exit \"$res\";\
                        \n        export OPAMCLI=2.0;\
                        \n        build_dir=$(opam var prefix)/.opam-switch/build;\
                        \n        failed=$(ls \"$build_dir\");\
                        \n        partial_fails=\"\";\
                        \n        for pkg in $failed; do\
                        \n          if opam show -f x-ci-accept-failures: \"$pkg\" | grep -qF \"\\\"debian-12\\\"\"; then\
                        \n            echo \"A package failed and has been disabled for CI using the 'x-ci-accept-failures' field.\";\
                        \n          fi;\
                        \n          test \"$pkg\" != 'spectrum.0.1.0' && partial_fails=\"$partial_fails $pkg\";\
                        \n        done;\
                        \n        test \"${partial_fails}\" != \"\" && echo \"opam-repo-ci detected dependencies failing: ${partial_fails}\";\
                        \n        exit 1"))
spectrum.0.1.0 is not installed. Install it? [y/n] y
The following actions will be performed:
=== install 1 package
  - install spectrum 0.1.0

<><> Processing actions <><><><><><><><><><><><><><><><><><><><><><><><><><><><>
Processing  1/3:
-> retrieved spectrum.0.1.0  (cached)
Processing  2/3: [spectrum: dune build]
+ /home/opam/.opam/opam-init/hooks/sandbox.sh "build" "dune" "build" "-p" "spectrum" "-j" "255" "@install" "@runtest" (CWD=/home/opam/.opam/5.1/.opam-switch/build/spectrum.0.1.0)
- File "tests/dune", line 2, characters 14-21:
- 2 |  (names lexer printer)
-                   ^^^^^^^
- (cd _build/default/tests && ./printer.exe)
- Testing `Printer'.
- This run has ID `33523B03-814C-4799-84D0-16211D94544E'.
- 
-   [OK]          Fatal error: exception File "src/fmt.ml", line 647, characters 60-66: Assertion failed
- (cd _build/default/tests && ./lexer.exe)
- Testing `Lexer'.
- This run has ID `92AC17AC-46D7-47DB-8E3B-F13D62EEF54F'.
- 
-   [OK]          Styles                             0   Bold.
-   [OK]          Styles                             1   Rapid blink.
-   [OK]          Named colors                       0   Foreground (implicit):...
-   [OK]          Named colors                       1   Foreground (explicit):...
-   [OK]          Named colors                       2   Background (explicit):...
-   [OK]          Named colors                       3   Foreground (implicit):...
-   [OK]          Named colors                       4   Foreground (explicit):...
-   [OK]          Named colors                       5   Background (explicit):...
-   [OK]          Compound from named color          0   Red, Underline.
-   [OK]          Compound from named color          1   Bg Red, Underline.
-   [OK]          Compound from named color          2   dark-olive-green-1a, B...
-   [OK]          Hex colors                         0   Foreground (implicit):...
-   [OK]          Hex colors                         1   Foreground (explicit):...
-   [OK]          Hex colors                         2   Background (explicit):...
-   [OK]          Hex colors                         3   Foreground (implicit):...
-   [OK]          Hex colors                         4   Foreground (explicit):...
-   [OK]          Hex colors                         5   Background (explicit):...
-   [OK]          Hex colors                         6   Foreground (implicit):...
-   [OK]          Hex colors                         7   Foreground (explicit):...
-   [OK]          Hex colors                         8   Background (explicit):...
-   [OK]          Hex colors                         9   Foreground (implicit):...
-   [OK]          Hex colors                        10   Foreground (explicit):...
-   [OK]          Hex colors                        11   Background (explicit):...
-   [OK]          Compound from hex color            0   #F00, Underline.
-   [OK]          Compound from hex color            1   Bg #f0c090, Bold.
- 
- Full test results in `~/.opam/5.1/.opam-switch/build/spectrum.0.1.0/_build/default/tests/_build/_tests/Lexer'.
- Test Successful in 0.001s. 25 tests run.
[ERROR] The compilation of spectrum.0.1.0 failed at "dune build -p spectrum -j 255 @install @runtest".

#=== ERROR while compiling spectrum.0.1.0 =====================================#
# context              2.2.0~beta2~dev | linux/x86_64 | ocaml-base-compiler.5.1.1 | file:///home/opam/opam-repository
# path                 ~/.opam/5.1/.opam-switch/build/spectrum.0.1.0
# command              ~/.opam/opam-init/hooks/sandbox.sh build dune build -p spectrum -j 255 @install @runtest
# exit-code            1
# env-file             ~/.opam/log/spectrum-7-5e338e.env
# output-file          ~/.opam/log/spectrum-7-5e338e.out
### output ###
# File "tests/dune", line 2, characters 14-21:
# 2 |  (names lexer printer)
#                   ^^^^^^^
# (cd _build/default/tests && ./printer.exe)
# Testing `Printer'.
# This run has ID `33523B03-814C-4799-84D0-16211D94544E'.
# 
#   [OK]          Fatal error: exception File "src/fmt.ml", line 647, characters 60-66: Assertion failed
# (cd _build/default/tests && ./lexer.exe)
# Testing `Lexer'.
# This run has ID `92AC17AC-46D7-47DB-8E3B-F13D62EEF54F'.
# 
#   [OK]          Styles                             0   Bold.
#   [OK]          Styles                             1   Rapid blink.
#   [OK]          Named colors                       0   Foreground (implicit):...
#   [OK]          Named colors                       1   Foreground (explicit):...
#   [OK]          Named colors                       2   Background (explicit):...
#   [OK]          Named colors                       3   Foreground (implicit):...
#   [OK]          Named colors                       4   Foreground (explicit):...
#   [OK]          Named colors                       5   Background (explicit):...
#   [OK]          Compound from named color          0   Red, Underline.
#   [OK]          Compound from named color          1   Bg Red, Underline.
#   [OK]          Compound from named color          2   dark-olive-green-1a, B...
#   [OK]          Hex colors                         0   Foreground (implicit):...
#   [OK]          Hex colors                         1   Foreground (explicit):...
#   [OK]          Hex colors                         2   Background (explicit):...
#   [OK]          Hex colors                         3   Foreground (implicit):...
#   [OK]          Hex colors                         4   Foreground (explicit):...
#   [OK]          Hex colors                         5   Background (explicit):...
#   [OK]          Hex colors                         6   Foreground (implicit):...
#   [OK]          Hex colors                         7   Foreground (explicit):...
#   [OK]          Hex colors                         8   Background (explicit):...
#   [OK]          Hex colors                         9   Foreground (implicit):...
#   [OK]          Hex colors                        10   Foreground (explicit):...
#   [OK]          Hex colors                        11   Background (explicit):...
#   [OK]          Compound from hex color            0   #F00, Underline.
#   [OK]          Compound from hex color            1   Bg #f0c090, Bold.
# 
# Full test results in `~/.opam/5.1/.opam-switch/build/spectrum.0.1.0/_build/default/tests/_build/_tests/Lexer'.
# Test Successful in 0.001s. 25 tests run.



<><> Error report <><><><><><><><><><><><><><><><><><><><><><><><><><><><><><><>
+- The following actions failed
| - build spectrum 0.1.0
+- 
- No changes have been performed
# Run eval $(opam env) to update the current shell environment
'opam reinstall --with-test --verbose spectrum.0.1.0' failed.
[WARNING] OPAMCONFIRMLEVEL was ignored because CLI 2.0 was requested and it was introduced in 2.1.
[WARNING] OPAMCONFIRMLEVEL was ignored because CLI 2.0 was requested and it was introduced in 2.1.
"/usr/bin/env" "bash" "-c" "opam reinstall --with-test --verbose spectrum.0.1.0;
        res=$?;
        test "$res" != 31 && exit "$res";
        export OPAMCLI=2.0;
        build_dir=$(opam var prefix)/.opam-switch/build;
        failed=$(ls "$build_dir");
        partial_fails="";
        for pkg in $failed; do
          if opam show -f x-ci-accept-failures: "$pkg" | grep -qF "\"debian-12\""; then
            echo "A package failed and has been disabled for CI using the 'x-ci-accept-failures' field.";
          fi;
          test "$pkg" != 'spectrum.0.1.0' && partial_fails="$partial_fails $pkg";
        done;
        test "${partial_fails}" != "" && echo "opam-repo-ci detected dependencies failing: ${partial_fails}";
        exit 1" failed with exit status 1
2024-02-12 20:08.13: Job failed: Failed: Build failed
2024-02-12 20:08.13: Log analysis:
2024-02-12 20:08.13: >>> 
[ERROR] The compilation of spectrum.0.1.0 failed at "dune build -p spectrum -j 255 @install @runtest".
 (score = 20)
2024-02-12 20:08.13: >>> 
[ERROR] The compilation of spectrum.0.1.0 failed at "dune build -p spectrum -j 255 @install @runtest".
 (score = 20)
2024-02-12 20:08.13: The compilation of spectrum.0.1.0 failed at "dune build -p spectrum -j 255 @install @runtest".