Build:
  1. 0
2024-02-11 20:23.47: New job: test crowbar.0.2 with conf-pkg-config.1.2, using opam dev
                              from https://github.com/ocaml/opam-repository.git#refs/pull/25235/head (8c7391d6ec81e93f24de221eb32a886b72d1ede6)
                              on debian-12-ocaml-5.1/amd64

To reproduce locally:

cd $(mktemp -d)
git clone --recursive "https://github.com/ocaml/opam-repository.git" && cd "opam-repository" && git fetch origin "refs/pull/25235/head" && git reset --hard 8c7391d6
git fetch origin master
git merge --no-edit 8477e9a74beb40d85534ab7653b65d45607a147f
cat > ../Dockerfile <<'END-OF-DOCKERFILE'
FROM ocaml/opam:debian-12-ocaml-5.1@sha256:931805f2c2fdb0b5642ae8463ff0780c2ee3f4afb48734a7d94e2d5163429930
USER 1000:1000
WORKDIR /home/opam
RUN sudo ln -f /usr/bin/opam-dev /usr/bin/opam
RUN opam init --reinit -ni
ENV OPAMDOWNLOADJOBS="1"
ENV OPAMERRLOGLEN="0"
ENV OPAMSOLVERTIMEOUT="500"
ENV OPAMPRECISETRACKING="1"
ENV CI="true"
ENV OPAM_REPO_CI="true"
RUN rm -rf opam-repository/
COPY --chown=1000:1000 . opam-repository/
RUN opam repository set-url --strict default opam-repository/
RUN opam update --depexts || true
ENV OPAMCRITERIA="-removed,-count[avoid-version,changed],-count[version-lag,request],-count[version-lag,changed],-count[missing-depexts,changed],-changed"
ENV OPAMFIXUPCRITERIA="-removed,-count[avoid-version,changed],-count[version-lag,request],-count[version-lag,changed],-count[missing-depexts,changed],-changed"
ENV OPAMUPGRADECRITERIA="-removed,-count[avoid-version,changed],-count[version-lag,request],-count[version-lag,changed],-count[missing-depexts,changed],-changed"
RUN opam pin add -k version -yn conf-pkg-config.1.2 1.2
RUN opam reinstall conf-pkg-config.1.2; \
    res=$?; \
    test "$res" != 31 && exit "$res"; \
    export OPAMCLI=2.0; \
    build_dir=$(opam var prefix)/.opam-switch/build; \
    failed=$(ls "$build_dir"); \
    partial_fails=""; \
    for pkg in $failed; do \
    if opam show -f x-ci-accept-failures: "$pkg" | grep -qF "\"debian-12\""; then \
    echo "A package failed and has been disabled for CI using the 'x-ci-accept-failures' field."; \
    fi; \
    test "$pkg" != 'conf-pkg-config.1.2' && partial_fails="$partial_fails $pkg"; \
    done; \
    test "${partial_fails}" != "" && echo "opam-repo-ci detected dependencies failing: ${partial_fails}"; \
    exit 1
ENV OPAMCRITERIA="-removed,-count[avoid-version,changed],-count[version-lag,request],-count[version-lag,changed],-count[missing-depexts,changed],-changed"
ENV OPAMFIXUPCRITERIA="-removed,-count[avoid-version,changed],-count[version-lag,request],-count[version-lag,changed],-count[missing-depexts,changed],-changed"
ENV OPAMUPGRADECRITERIA="-removed,-count[avoid-version,changed],-count[version-lag,request],-count[version-lag,changed],-count[missing-depexts,changed],-changed"
RUN opam reinstall crowbar.0.2; \
    res=$?; \
    test "$res" != 31 && exit "$res"; \
    export OPAMCLI=2.0; \
    build_dir=$(opam var prefix)/.opam-switch/build; \
    failed=$(ls "$build_dir"); \
    partial_fails=""; \
    for pkg in $failed; do \
    if opam show -f x-ci-accept-failures: "$pkg" | grep -qF "\"debian-12\""; then \
    echo "A package failed and has been disabled for CI using the 'x-ci-accept-failures' field."; \
    fi; \
    test "$pkg" != 'crowbar.0.2' && partial_fails="$partial_fails $pkg"; \
    done; \
    test "${partial_fails}" != "" && echo "opam-repo-ci detected dependencies failing: ${partial_fails}"; \
    exit 1
ENV OPAMCRITERIA="-removed,-count[avoid-version,changed],-count[version-lag,request],-count[version-lag,changed],-count[missing-depexts,changed],-changed"
ENV OPAMFIXUPCRITERIA="-removed,-count[avoid-version,changed],-count[version-lag,request],-count[version-lag,changed],-count[missing-depexts,changed],-changed"
ENV OPAMUPGRADECRITERIA="-removed,-count[avoid-version,changed],-count[version-lag,request],-count[version-lag,changed],-count[missing-depexts,changed],-changed"
RUN (opam reinstall --with-test crowbar.0.2) || true
RUN opam reinstall --with-test --verbose crowbar.0.2; \
    res=$?; \
    test "$res" != 31 && exit "$res"; \
    export OPAMCLI=2.0; \
    build_dir=$(opam var prefix)/.opam-switch/build; \
    failed=$(ls "$build_dir"); \
    partial_fails=""; \
    for pkg in $failed; do \
    if opam show -f x-ci-accept-failures: "$pkg" | grep -qF "\"debian-12\""; then \
    echo "A package failed and has been disabled for CI using the 'x-ci-accept-failures' field."; \
    fi; \
    test "$pkg" != 'crowbar.0.2' && partial_fails="$partial_fails $pkg"; \
    done; \
    test "${partial_fails}" != "" && echo "opam-repo-ci detected dependencies failing: ${partial_fails}"; \
    exit 1

END-OF-DOCKERFILE
docker build -f ../Dockerfile .

2024-02-11 20:23.47: Using cache hint "ocaml/opam:debian-12-ocaml-5.1@sha256:931805f2c2fdb0b5642ae8463ff0780c2ee3f4afb48734a7d94e2d5163429930-conf-pkg-config.1.2-crowbar.0.2-8c7391d6ec81e93f24de221eb32a886b72d1ede6"
2024-02-11 20:23.47: Using OBuilder spec:
((from ocaml/opam:debian-12-ocaml-5.1@sha256:931805f2c2fdb0b5642ae8463ff0780c2ee3f4afb48734a7d94e2d5163429930)
 (user (uid 1000) (gid 1000))
 (workdir /home/opam)
 (run (shell "sudo ln -f /usr/bin/opam-dev /usr/bin/opam"))
 (run (network host)
      (shell "opam init --reinit --config .opamrc-sandbox -ni"))
 (env OPAMDOWNLOADJOBS 1)
 (env OPAMERRLOGLEN 0)
 (env OPAMSOLVERTIMEOUT 500)
 (env OPAMPRECISETRACKING 1)
 (env CI true)
 (env OPAM_REPO_CI true)
 (run (shell "rm -rf opam-repository/"))
 (copy (src .) (dst opam-repository/))
 (run (shell "opam repository set-url --strict default opam-repository/"))
 (run (network host)
      (shell "opam update --depexts || true"))
 (env OPAMCRITERIA -removed,-count[avoid-version,changed],-count[version-lag,request],-count[version-lag,changed],-count[missing-depexts,changed],-changed)
 (env OPAMFIXUPCRITERIA -removed,-count[avoid-version,changed],-count[version-lag,request],-count[version-lag,changed],-count[missing-depexts,changed],-changed)
 (env OPAMUPGRADECRITERIA -removed,-count[avoid-version,changed],-count[version-lag,request],-count[version-lag,changed],-count[missing-depexts,changed],-changed)
 (run (shell "opam pin add -k version -yn conf-pkg-config.1.2 1.2"))
 (run (cache (opam-archives (target /home/opam/.opam/download-cache)))
      (network host)
      (shell  "opam reinstall conf-pkg-config.1.2;\
             \n        res=$?;\
             \n        test \"$res\" != 31 && exit \"$res\";\
             \n        export OPAMCLI=2.0;\
             \n        build_dir=$(opam var prefix)/.opam-switch/build;\
             \n        failed=$(ls \"$build_dir\");\
             \n        partial_fails=\"\";\
             \n        for pkg in $failed; do\
             \n          if opam show -f x-ci-accept-failures: \"$pkg\" | grep -qF \"\\\"debian-12\\\"\"; then\
             \n            echo \"A package failed and has been disabled for CI using the 'x-ci-accept-failures' field.\";\
             \n          fi;\
             \n          test \"$pkg\" != 'conf-pkg-config.1.2' && partial_fails=\"$partial_fails $pkg\";\
             \n        done;\
             \n        test \"${partial_fails}\" != \"\" && echo \"opam-repo-ci detected dependencies failing: ${partial_fails}\";\
             \n        exit 1"))
 (env OPAMCRITERIA -removed,-count[avoid-version,changed],-count[version-lag,request],-count[version-lag,changed],-count[missing-depexts,changed],-changed)
 (env OPAMFIXUPCRITERIA -removed,-count[avoid-version,changed],-count[version-lag,request],-count[version-lag,changed],-count[missing-depexts,changed],-changed)
 (env OPAMUPGRADECRITERIA -removed,-count[avoid-version,changed],-count[version-lag,request],-count[version-lag,changed],-count[missing-depexts,changed],-changed)
 (run (cache (opam-archives (target /home/opam/.opam/download-cache)))
      (network host)
      (shell  "opam reinstall crowbar.0.2;\
             \n        res=$?;\
             \n        test \"$res\" != 31 && exit \"$res\";\
             \n        export OPAMCLI=2.0;\
             \n        build_dir=$(opam var prefix)/.opam-switch/build;\
             \n        failed=$(ls \"$build_dir\");\
             \n        partial_fails=\"\";\
             \n        for pkg in $failed; do\
             \n          if opam show -f x-ci-accept-failures: \"$pkg\" | grep -qF \"\\\"debian-12\\\"\"; then\
             \n            echo \"A package failed and has been disabled for CI using the 'x-ci-accept-failures' field.\";\
             \n          fi;\
             \n          test \"$pkg\" != 'crowbar.0.2' && partial_fails=\"$partial_fails $pkg\";\
             \n        done;\
             \n        test \"${partial_fails}\" != \"\" && echo \"opam-repo-ci detected dependencies failing: ${partial_fails}\";\
             \n        exit 1"))
 (env OPAMCRITERIA -removed,-count[avoid-version,changed],-count[version-lag,request],-count[version-lag,changed],-count[missing-depexts,changed],-changed)
 (env OPAMFIXUPCRITERIA -removed,-count[avoid-version,changed],-count[version-lag,request],-count[version-lag,changed],-count[missing-depexts,changed],-changed)
 (env OPAMUPGRADECRITERIA -removed,-count[avoid-version,changed],-count[version-lag,request],-count[version-lag,changed],-count[missing-depexts,changed],-changed)
 (run (network host)
      (shell "(opam reinstall --with-test crowbar.0.2) || true"))
 (run (shell  "opam reinstall --with-test --verbose crowbar.0.2;\
             \n        res=$?;\
             \n        test \"$res\" != 31 && exit \"$res\";\
             \n        export OPAMCLI=2.0;\
             \n        build_dir=$(opam var prefix)/.opam-switch/build;\
             \n        failed=$(ls \"$build_dir\");\
             \n        partial_fails=\"\";\
             \n        for pkg in $failed; do\
             \n          if opam show -f x-ci-accept-failures: \"$pkg\" | grep -qF \"\\\"debian-12\\\"\"; then\
             \n            echo \"A package failed and has been disabled for CI using the 'x-ci-accept-failures' field.\";\
             \n          fi;\
             \n          test \"$pkg\" != 'crowbar.0.2' && partial_fails=\"$partial_fails $pkg\";\
             \n        done;\
             \n        test \"${partial_fails}\" != \"\" && echo \"opam-repo-ci detected dependencies failing: ${partial_fails}\";\
             \n        exit 1"))
)

2024-02-11 20:23.47: Waiting for resource in pool OCluster
2024-02-12 19:24.12: Waiting for worker…
2024-02-12 19:25.58: Got resource from pool OCluster
Building on marpe.caelum.ci.dev
All commits already cached
Updating files:  78% (25827/32918)
Updating files:  79% (26006/32918)
Updating files:  80% (26335/32918)
Updating files:  81% (26664/32918)
Updating files:  82% (26993/32918)
Updating files:  83% (27322/32918)
Updating files:  84% (27652/32918)
Updating files:  85% (27981/32918)
Updating files:  86% (28310/32918)
Updating files:  87% (28639/32918)
Updating files:  88% (28968/32918)
Updating files:  89% (29298/32918)
Updating files:  90% (29627/32918)
Updating files:  91% (29956/32918)
Updating files:  92% (30285/32918)
Updating files:  93% (30614/32918)
Updating files:  94% (30943/32918)
Updating files:  95% (31273/32918)
Updating files:  96% (31602/32918)
Updating files:  97% (31931/32918)
Updating files:  98% (32260/32918)
Updating files:  99% (32589/32918)
Updating files: 100% (32918/32918)
Updating files: 100% (32918/32918), done.
HEAD is now at 8477e9a74b Merge pull request #25221 from nberth/mlgmpidl-1.3.0
Updating 8477e9a74b..8c7391d6ec
Fast-forward
 packages/conf-pkg-config/conf-pkg-config.1.0/opam | 2 +-
 packages/conf-pkg-config/conf-pkg-config.1.1/opam | 1 +
 packages/conf-pkg-config/conf-pkg-config.1.2/opam | 1 +
 packages/conf-pkg-config/conf-pkg-config.1.3/opam | 1 +
 packages/conf-pkg-config/conf-pkg-config.2/opam   | 1 +
 packages/conf-pkg-config/conf-pkg-config.3/opam   | 4 +++-
 6 files changed, 8 insertions(+), 2 deletions(-)

(from ocaml/opam:debian-12-ocaml-5.1@sha256:931805f2c2fdb0b5642ae8463ff0780c2ee3f4afb48734a7d94e2d5163429930)
2024-02-12 19:44.04 ---> using "4df7ce52b8e0afe130cbfff7d9b001e43cae58bd8e8710cd073ce7c11b1c6ac8" from cache

/: (user (uid 1000) (gid 1000))

/: (workdir /home/opam)

/home/opam: (run (shell "sudo ln -f /usr/bin/opam-dev /usr/bin/opam"))
2024-02-12 19:44.04 ---> using "2ee14a5dbb7aa54ab1dfa5adba4422c5a5483941525d4174e8eeed0c4c5e97aa" from cache

/home/opam: (run (network host)
                 (shell "opam init --reinit --config .opamrc-sandbox -ni"))
Configuring from /home/opam/.opamrc-sandbox, then /home/opam/.opamrc, and finally from built-in defaults.
Checking for available remotes: rsync and local, git.
  - you won't be able to use mercurial repositories unless you install the hg command on your system.
  - you won't be able to use darcs repositories unless you install the darcs command on your system.

This development version of opam requires an update to the layout of /home/opam/.opam from version 2.0 to version 2.2~alpha, which can't be reverted.
You may want to back it up before going further.

Continue? [y/n] y
[NOTE] The 'jobs' option was reset, its value was 71 and its new value will vary according to the current number of cores on your machine. You can restore the fixed value using:
           opam option jobs=71 --global
Format upgrade done.

<><> Updating repositories ><><><><><><><><><><><><><><><><><><><><><><><><><><>
[default] synchronised from file:///home/opam/opam-repository
2024-02-12 19:44.04 ---> using "d58131e4d084860f74dbebecfc9a35ebb7fbb42cf58093b5ac6cf0adf11ed898" from cache

/home/opam: (env OPAMDOWNLOADJOBS 1)

/home/opam: (env OPAMERRLOGLEN 0)

/home/opam: (env OPAMSOLVERTIMEOUT 500)

/home/opam: (env OPAMPRECISETRACKING 1)

/home/opam: (env CI true)

/home/opam: (env OPAM_REPO_CI true)

/home/opam: (run (shell "rm -rf opam-repository/"))
2024-02-12 19:44.04 ---> using "e76676ee91f5598b65d18de047738848e5af056a75e3436903dc82ff5702c5a6" from cache

/home/opam: (copy (src .) (dst opam-repository/))
2024-02-12 19:44.05 ---> using "00dcf922e87fec2f8ccdd0b44355d41faed143c596db4bfe8812d0e9c5f33f02" from cache

/home/opam: (run (shell "opam repository set-url --strict default opam-repository/"))
[default] Initialised
2024-02-12 19:44.05 ---> using "d6c8604b98b9d01914259989eafdfad7780b6c9f761a469dfe3162a56ba73510" from cache

/home/opam: (run (network host)
                 (shell "opam update --depexts || true"))
+ /usr/bin/sudo "apt-get" "update"
- Get:1 http://deb.debian.org/debian bookworm InRelease [151 kB]
- Get:2 http://deb.debian.org/debian bookworm-updates InRelease [52.1 kB]
- Get:3 http://deb.debian.org/debian-security bookworm-security InRelease [48.0 kB]
- Get:4 http://deb.debian.org/debian bookworm/main amd64 Packages [8786 kB]
- Get:5 http://deb.debian.org/debian-security bookworm-security/main amd64 Packages [137 kB]
- Fetched 9175 kB in 1s (7250 kB/s)
- Reading package lists...
2024-02-12 19:44.05 ---> using "6245d7929b862e6b37f451133c05d21883283d0248743f67197f2e424fe52d69" from cache

/home/opam: (env OPAMCRITERIA -removed,-count[avoid-version,changed],-count[version-lag,request],-count[version-lag,changed],-count[missing-depexts,changed],-changed)

/home/opam: (env OPAMFIXUPCRITERIA -removed,-count[avoid-version,changed],-count[version-lag,request],-count[version-lag,changed],-count[missing-depexts,changed],-changed)

/home/opam: (env OPAMUPGRADECRITERIA -removed,-count[avoid-version,changed],-count[version-lag,request],-count[version-lag,changed],-count[missing-depexts,changed],-changed)

/home/opam: (run (shell "opam pin add -k version -yn conf-pkg-config.1.2 1.2"))
conf-pkg-config is now pinned to version 1.2
2024-02-12 19:44.05 ---> using "8c93380d2ff9f8574e0d694d02b593f1bcffc4ad4341b85941c7abc0f7411957" from cache

/home/opam: (run (cache (opam-archives (target /home/opam/.opam/download-cache)))
                 (network host)
                 (shell  "opam reinstall conf-pkg-config.1.2;\
                        \n        res=$?;\
                        \n        test \"$res\" != 31 && exit \"$res\";\
                        \n        export OPAMCLI=2.0;\
                        \n        build_dir=$(opam var prefix)/.opam-switch/build;\
                        \n        failed=$(ls \"$build_dir\");\
                        \n        partial_fails=\"\";\
                        \n        for pkg in $failed; do\
                        \n          if opam show -f x-ci-accept-failures: \"$pkg\" | grep -qF \"\\\"debian-12\\\"\"; then\
                        \n            echo \"A package failed and has been disabled for CI using the 'x-ci-accept-failures' field.\";\
                        \n          fi;\
                        \n          test \"$pkg\" != 'conf-pkg-config.1.2' && partial_fails=\"$partial_fails $pkg\";\
                        \n        done;\
                        \n        test \"${partial_fails}\" != \"\" && echo \"opam-repo-ci detected dependencies failing: ${partial_fails}\";\
                        \n        exit 1"))
conf-pkg-config.1.2 is not installed. Install it? [y/n] y
The following actions will be performed:
=== install 1 package
  - install conf-pkg-config 1.2 (pinned)

The following system packages will first need to be installed:
    pkg-config

<><> Handling external dependencies <><><><><><><><><><><><><><><><><><><><><><>

opam believes some required external dependencies are missing. opam can:
> 1. Run apt-get to install them (may need root/sudo access)
  2. Display the recommended apt-get command and wait while you run it manually (e.g. in another terminal)
  3. Continue anyway, and, upon success, permanently register that this external dependency is present, but not detectable
  4. Abort the installation

[1/2/3/4] 1

+ /usr/bin/sudo "apt-get" "install" "-qq" "-yy" "pkg-config"
- debconf: delaying package configuration, since apt-utils is not installed
- Selecting previously unselected package libpkgconf3:amd64.
- (Reading database ... 
(Reading database ... 5%
(Reading database ... 10%
(Reading database ... 15%
(Reading database ... 20%
(Reading database ... 25%
(Reading database ... 30%
(Reading database ... 35%
(Reading database ... 40%
(Reading database ... 45%
(Reading database ... 50%
(Reading database ... 55%
(Reading database ... 60%
(Reading database ... 65%
(Reading database ... 70%
(Reading database ... 75%
(Reading database ... 80%
(Reading database ... 85%
(Reading database ... 90%
(Reading database ... 95%
(Reading database ... 100%
(Reading database ... 18774 files and directories currently installed.)
- Preparing to unpack .../libpkgconf3_1.8.1-1_amd64.deb ...
- Unpacking libpkgconf3:amd64 (1.8.1-1) ...
- Selecting previously unselected package pkgconf-bin.
- Preparing to unpack .../pkgconf-bin_1.8.1-1_amd64.deb ...
- Unpacking pkgconf-bin (1.8.1-1) ...
- Selecting previously unselected package pkgconf:amd64.
- Preparing to unpack .../pkgconf_1.8.1-1_amd64.deb ...
- Unpacking pkgconf:amd64 (1.8.1-1) ...
- Selecting previously unselected package pkg-config:amd64.
- Preparing to unpack .../pkg-config_1.8.1-1_amd64.deb ...
- Unpacking pkg-config:amd64 (1.8.1-1) ...
- Setting up libpkgconf3:amd64 (1.8.1-1) ...
- Setting up pkgconf-bin (1.8.1-1) ...
- Setting up pkgconf:amd64 (1.8.1-1) ...
- Setting up pkg-config:amd64 (1.8.1-1) ...
- Processing triggers for libc-bin (2.36-9+deb12u4) ...

<><> Processing actions <><><><><><><><><><><><><><><><><><><><><><><><><><><><>
-> installed conf-pkg-config.1.2
Done.
# Run eval $(opam env) to update the current shell environment
2024-02-12 19:44.05 ---> using "5e9c2e7cd37deee211329af698b5958f49f052be907d8360c30cbb9696858e09" from cache

/home/opam: (env OPAMCRITERIA -removed,-count[avoid-version,changed],-count[version-lag,request],-count[version-lag,changed],-count[missing-depexts,changed],-changed)

/home/opam: (env OPAMFIXUPCRITERIA -removed,-count[avoid-version,changed],-count[version-lag,request],-count[version-lag,changed],-count[missing-depexts,changed],-changed)

/home/opam: (env OPAMUPGRADECRITERIA -removed,-count[avoid-version,changed],-count[version-lag,request],-count[version-lag,changed],-count[missing-depexts,changed],-changed)

/home/opam: (run (cache (opam-archives (target /home/opam/.opam/download-cache)))
                 (network host)
                 (shell  "opam reinstall crowbar.0.2;\
                        \n        res=$?;\
                        \n        test \"$res\" != 31 && exit \"$res\";\
                        \n        export OPAMCLI=2.0;\
                        \n        build_dir=$(opam var prefix)/.opam-switch/build;\
                        \n        failed=$(ls \"$build_dir\");\
                        \n        partial_fails=\"\";\
                        \n        for pkg in $failed; do\
                        \n          if opam show -f x-ci-accept-failures: \"$pkg\" | grep -qF \"\\\"debian-12\\\"\"; then\
                        \n            echo \"A package failed and has been disabled for CI using the 'x-ci-accept-failures' field.\";\
                        \n          fi;\
                        \n          test \"$pkg\" != 'crowbar.0.2' && partial_fails=\"$partial_fails $pkg\";\
                        \n        done;\
                        \n        test \"${partial_fails}\" != \"\" && echo \"opam-repo-ci detected dependencies failing: ${partial_fails}\";\
                        \n        exit 1"))
crowbar.0.2 is not installed. Install it? [y/n] y
The following actions will be performed:
=== install 8 packages
  - install afl-persistent 1.4    [required by crowbar]
  - install base-bytes     base   [required by ocplib-endian]
  - install cmdliner       1.0.4  [required by crowbar]
  - install cppo           1.6.9  [required by ocplib-endian]
  - install crowbar        0.2
  - install dune           3.13.1 [required by crowbar]
  - install ocamlfind      1.9.6  [required by base-bytes]
  - install ocplib-endian  1.2    [required by crowbar]

<><> Processing actions <><><><><><><><><><><><><><><><><><><><><><><><><><><><>
-> retrieved afl-persistent.1.4  (cached)
-> retrieved cmdliner.1.0.4  (cached)
-> retrieved cppo.1.6.9  (cached)
-> retrieved crowbar.0.2  (cached)
-> retrieved dune.3.13.1  (cached)
-> retrieved ocamlfind.1.9.6  (cached)
-> retrieved ocplib-endian.1.2  (cached)
-> installed cmdliner.1.0.4
-> installed ocamlfind.1.9.6
-> installed base-bytes.base
-> installed dune.3.13.1
-> installed afl-persistent.1.4
-> installed cppo.1.6.9
-> installed ocplib-endian.1.2
-> installed crowbar.0.2
Done.

<><> afl-persistent.1.4 installed successfully ><><><><><><><><><><><><><><><><>
=> afl-persistent is installed, but since the current OCaml compiler does
   not enable AFL instrumentation by default, most packages will not be
   instrumented and fuzzing with afl-fuzz may not be effective.

   To globally enable AFL instrumentation, create an OCaml switch like:

     opam switch create 5.1.1+afl ocaml-variants.5.1.1+options ocaml-option-afl
# Run eval $(opam env) to update the current shell environment
2024-02-12 19:44.34 ---> saved as "ba8194051983b79f97854ea3ac1a9d766656b5396b4bfc0cdc5b56469757b12e"

/home/opam: (env OPAMCRITERIA -removed,-count[avoid-version,changed],-count[version-lag,request],-count[version-lag,changed],-count[missing-depexts,changed],-changed)

/home/opam: (env OPAMFIXUPCRITERIA -removed,-count[avoid-version,changed],-count[version-lag,request],-count[version-lag,changed],-count[missing-depexts,changed],-changed)

/home/opam: (env OPAMUPGRADECRITERIA -removed,-count[avoid-version,changed],-count[version-lag,request],-count[version-lag,changed],-count[missing-depexts,changed],-changed)

/home/opam: (run (network host)
                 (shell "(opam reinstall --with-test crowbar.0.2) || true"))
The following actions will be performed:
=== recompile 1 package
  - recompile crowbar    0.2
=== install 10 packages
  - install   astring    0.8.5  [required by fpath]
  - install   calendar   3.0.0  [required by crowbar]
  - install   fpath      0.7.3  [required by crowbar]
  - install   ocamlbuild 0.14.3 [required by fpath, uucp]
  - install   re         1.11.0 [required by calendar]
  - install   seq        base   [required by re]
  - install   topkg      1.0.7  [required by fpath, uucp]
  - install   uucp       14.0.0 [required by crowbar]
  - install   uunf       14.0.0 [required by crowbar]
  - install   uutf       1.0.3  [required by crowbar]

<><> Processing actions <><><><><><><><><><><><><><><><><><><><><><><><><><><><>
-> retrieved astring.0.8.5  (https://erratique.ch/software/astring/releases/astring-0.8.5.tbz)
-> retrieved calendar.3.0.0  (https://github.com/ocaml-community/calendar/archive/refs/tags/v3.0.0.tar.gz)
-> retrieved crowbar.0.2  (https://github.com/stedolan/crowbar/archive/v0.2.tar.gz)
-> retrieved fpath.0.7.3  (https://erratique.ch/software/fpath/releases/fpath-0.7.3.tbz)
-> retrieved ocamlbuild.0.14.3  (https://github.com/ocaml/ocamlbuild/archive/refs/tags/0.14.3.tar.gz)
-> retrieved re.1.11.0  (https://github.com/ocaml/ocaml-re/releases/download/1.11.0/re-1.11.0.tbz)
-> installed seq.base
-> retrieved topkg.1.0.7  (https://erratique.ch/software/topkg/releases/topkg-1.0.7.tbz)
-> retrieved uucp.14.0.0  (https://erratique.ch/software/uucp/releases/uucp-14.0.0.tbz)
-> retrieved uunf.14.0.0  (https://erratique.ch/software/uunf/releases/uunf-14.0.0.tbz)
-> retrieved uutf.1.0.3  (https://erratique.ch/software/uutf/releases/uutf-1.0.3.tbz)
-> installed re.1.11.0
-> installed calendar.3.0.0
-> removed   crowbar.0.2
-> installed ocamlbuild.0.14.3
-> installed topkg.1.0.7
-> installed uutf.1.0.3
-> installed astring.0.8.5
-> installed fpath.0.7.3
-> installed uunf.14.0.0
-> installed uucp.14.0.0
[ERROR] The compilation of crowbar.0.2 failed at "dune build -p crowbar -j 255 @examples/calendar/runtest @examples/fpath/runtest @examples/map/runtest @examples/serializer/runtest @examples/uunf/runtest".

#=== ERROR while compiling crowbar.0.2 ========================================#
# context              2.2.0~beta2~dev | linux/x86_64 | ocaml-base-compiler.5.1.1 | file:///home/opam/opam-repository
# path                 ~/.opam/5.1/.opam-switch/build/crowbar.0.2
# command              ~/.opam/opam-init/hooks/sandbox.sh build dune build -p crowbar -j 255 @examples/calendar/runtest @examples/fpath/runtest @examples/map/runtest @examples/serializer/runtest @examples/uunf/runtest
# exit-code            1
# env-file             ~/.opam/log/crowbar-7-63d186.env
# output-file          ~/.opam/log/crowbar-7-63d186.out
### output ###
# (cd _build/default/examples/map && ./test_map.exe)
# map: PASS
# 
# File "examples/calendar/dune", line 2, characters 7-20:
# 2 |  (name test_calendar)
#            ^^^^^^^^^^^^^
# (cd _build/default/examples/calendar && ./test_calendar.exe)
# calendar: FAIL
# 
# When given the input:
# 
#     [1995-08-31 11:32:28; 1995-12-08 12:01:19]
#     
# the test failed:
# 
#     1995-12-09 12:01:19 != 1995-12-08 12:01:19
#     
# (cd _build/default/examples/fpath && ./test_fpath.exe)
# segs: PASS
# 
# (cd _build/default/examples/serializer && ./test_serializer.exe)
# pairs: PASS
# 
# (cd _build/default/examples/uunf && ./test_uunf.exe)
# uunf: PASS
# 



<><> Error report <><><><><><><><><><><><><><><><><><><><><><><><><><><><><><><>
+- The following actions failed
| - build crowbar 0.2
+- 
+- The following changes have been performed
| - remove  crowbar    0.2
| - install astring    0.8.5
| - install calendar   3.0.0
| - install fpath      0.7.3
| - install ocamlbuild 0.14.3
| - install re         1.11.0
| - install seq        base
| - install topkg      1.0.7
| - install uucp       14.0.0
| - install uunf       14.0.0
| - install uutf       1.0.3
+- 
# Run eval $(opam env) to update the current shell environment

The former state can be restored with:
    /usr/bin/opam switch import "/home/opam/.opam/5.1/.opam-switch/backup/state-20240212194434.export"
Or you can retry to install your package selection with:
    /usr/bin/opam install --restore
2024-02-12 19:45.28 ---> saved as "9661290fa5518fc87946362e9641a44df6764b12eaa149724a48518a346821be"

/home/opam: (run (shell  "opam reinstall --with-test --verbose crowbar.0.2;\
                        \n        res=$?;\
                        \n        test \"$res\" != 31 && exit \"$res\";\
                        \n        export OPAMCLI=2.0;\
                        \n        build_dir=$(opam var prefix)/.opam-switch/build;\
                        \n        failed=$(ls \"$build_dir\");\
                        \n        partial_fails=\"\";\
                        \n        for pkg in $failed; do\
                        \n          if opam show -f x-ci-accept-failures: \"$pkg\" | grep -qF \"\\\"debian-12\\\"\"; then\
                        \n            echo \"A package failed and has been disabled for CI using the 'x-ci-accept-failures' field.\";\
                        \n          fi;\
                        \n          test \"$pkg\" != 'crowbar.0.2' && partial_fails=\"$partial_fails $pkg\";\
                        \n        done;\
                        \n        test \"${partial_fails}\" != \"\" && echo \"opam-repo-ci detected dependencies failing: ${partial_fails}\";\
                        \n        exit 1"))
crowbar.0.2 is not installed. Install it? [y/n] y
The following actions will be performed:
=== install 1 package
  - install crowbar 0.2

<><> Processing actions <><><><><><><><><><><><><><><><><><><><><><><><><><><><>
Processing  1/3:
-> retrieved crowbar.0.2  (cached)
Processing  2/3: [crowbar: dune build]
+ /home/opam/.opam/opam-init/hooks/sandbox.sh "build" "dune" "build" "-p" "crowbar" "-j" "255" (CWD=/home/opam/.opam/5.1/.opam-switch/build/crowbar.0.2)
+ /home/opam/.opam/opam-init/hooks/sandbox.sh "build" "dune" "build" "-p" "crowbar" "-j" "255" "@examples/calendar/runtest" "@examples/fpath/runtest" "@examples/map/runtest" "@examples/serializer/runtest" "@examples/uunf/runtest" (CWD=/home/opam/.opam/5.1/.opam-switch/build/crowbar.0.2)
- File "examples/calendar/dune", line 2, characters 7-20:
- 2 |  (name test_calendar)
-            ^^^^^^^^^^^^^
- (cd _build/default/examples/calendar && ./test_calendar.exe)
- calendar: FAIL
- 
- When given the input:
- 
-     [1995-08-31 11:32:28; 1995-12-08 12:01:19]
-     
- the test failed:
- 
-     1995-12-09 12:01:19 != 1995-12-08 12:01:19
-     
- (cd _build/default/examples/map && ./test_map.exe)
- map: PASS
- 
- (cd _build/default/examples/fpath && ./test_fpath.exe)
- segs: PASS
- 
- (cd _build/default/examples/serializer && ./test_serializer.exe)
- pairs: PASS
- 
- (cd _build/default/examples/uunf && ./test_uunf.exe)
- uunf: PASS
- 
[ERROR] The compilation of crowbar.0.2 failed at "dune build -p crowbar -j 255 @examples/calendar/runtest @examples/fpath/runtest @examples/map/runtest @examples/serializer/runtest @examples/uunf/runtest".

#=== ERROR while compiling crowbar.0.2 ========================================#
# context              2.2.0~beta2~dev | linux/x86_64 | ocaml-base-compiler.5.1.1 | file:///home/opam/opam-repository
# path                 ~/.opam/5.1/.opam-switch/build/crowbar.0.2
# command              ~/.opam/opam-init/hooks/sandbox.sh build dune build -p crowbar -j 255 @examples/calendar/runtest @examples/fpath/runtest @examples/map/runtest @examples/serializer/runtest @examples/uunf/runtest
# exit-code            1
# env-file             ~/.opam/log/crowbar-7-e39375.env
# output-file          ~/.opam/log/crowbar-7-e39375.out
### output ###
# File "examples/calendar/dune", line 2, characters 7-20:
# 2 |  (name test_calendar)
#            ^^^^^^^^^^^^^
# (cd _build/default/examples/calendar && ./test_calendar.exe)
# calendar: FAIL
# 
# When given the input:
# 
#     [1995-08-31 11:32:28; 1995-12-08 12:01:19]
#     
# the test failed:
# 
#     1995-12-09 12:01:19 != 1995-12-08 12:01:19
#     
# (cd _build/default/examples/map && ./test_map.exe)
# map: PASS
# 
# (cd _build/default/examples/fpath && ./test_fpath.exe)
# segs: PASS
# 
# (cd _build/default/examples/serializer && ./test_serializer.exe)
# pairs: PASS
# 
# (cd _build/default/examples/uunf && ./test_uunf.exe)
# uunf: PASS
# 



<><> Error report <><><><><><><><><><><><><><><><><><><><><><><><><><><><><><><>
+- The following actions failed
| - build crowbar 0.2
+- 
- No changes have been performed
# Run eval $(opam env) to update the current shell environment
'opam reinstall --with-test --verbose crowbar.0.2' failed.
[WARNING] OPAMCONFIRMLEVEL was ignored because CLI 2.0 was requested and it was introduced in 2.1.
[WARNING] OPAMCONFIRMLEVEL was ignored because CLI 2.0 was requested and it was introduced in 2.1.
"/usr/bin/env" "bash" "-c" "opam reinstall --with-test --verbose crowbar.0.2;
        res=$?;
        test "$res" != 31 && exit "$res";
        export OPAMCLI=2.0;
        build_dir=$(opam var prefix)/.opam-switch/build;
        failed=$(ls "$build_dir");
        partial_fails="";
        for pkg in $failed; do
          if opam show -f x-ci-accept-failures: "$pkg" | grep -qF "\"debian-12\""; then
            echo "A package failed and has been disabled for CI using the 'x-ci-accept-failures' field.";
          fi;
          test "$pkg" != 'crowbar.0.2' && partial_fails="$partial_fails $pkg";
        done;
        test "${partial_fails}" != "" && echo "opam-repo-ci detected dependencies failing: ${partial_fails}";
        exit 1" failed with exit status 1
2024-02-12 19:46.12: Job failed: Failed: Build failed
2024-02-12 19:46.12: Log analysis:
2024-02-12 19:46.12: >>> 
[ERROR] The compilation of crowbar.0.2 failed at "dune build -p crowbar -j 255 @examples/calendar/runtest @examples/fpath/runtest @examples/map/runtest @examples/serializer/runtest @examples/uunf/runtest".
 (score = 20)
2024-02-12 19:46.12: >>> 
[ERROR] The compilation of crowbar.0.2 failed at "dune build -p crowbar -j 255 @examples/calendar/runtest @examples/fpath/runtest @examples/map/runtest @examples/serializer/runtest @examples/uunf/runtest".
 (score = 20)
2024-02-12 19:46.12: The compilation of crowbar.0.2 failed at "dune build -p crowbar -j 255 @examples/calendar/runtest @examples/fpath/runtest @examples/map/runtest @examples/serializer/runtest @examples/uunf/runtest".